ci_feature_beta_deps

2019-04-19 07:25:54: ============================================================
2019-04-19 07:25:54: Initializing flow: FlowCoordinator (ci_feature_beta_deps)
2019-04-19 07:25:54: Install the latest beta version of dependencies and run apex tests.
2019-04-19 07:25:54: ============================================================
2019-04-19 07:25:54: 
2019-04-19 07:25:54: Verifying and refreshing credentials for the specified org: feature_namespaced.
2019-04-19 07:25:54: ------------------------------------------------------------
2019-04-19 07:25:54: Organization:
2019-04-19 07:25:54:   Username: test-2rxwkcqcbqrc@example.com
2019-04-19 07:25:54:     Org Id: 00D190000009eJN
2019-04-19 07:25:54: ------------------------------------------------------------
2019-04-19 07:25:54: 
2019-04-19 07:25:54: ------------------------------------------------------------
2019-04-19 07:25:54: Steps:
2019-04-19 07:25:54: 1.1: beta_dependencies.update_dependencies: Installs all dependencies in project__dependencies into the target org
2019-04-19 07:25:54: 1.2: beta_dependencies.deploy_pre: Deploys all metadata bundles under unpackaged/pre/
2019-04-19 07:25:54: 2.1: deploy_unmanaged.unschedule_apex: Unschedule all scheduled apex jobs (CronTriggers).
2019-04-19 07:25:54: 2.2: deploy_unmanaged.update_package_xml: Updates src/package.xml with metadata in src/
2019-04-19 07:25:54: 2.3: deploy_unmanaged.deploy: Deploys the src directory of the repository to the org
2019-04-19 07:25:54: 2.4: deploy_unmanaged.uninstall_packaged_incremental: Deletes any metadata from the package in the target org not in the local workspace
2019-04-19 07:25:54: 3.1: config_apextest.deploy_post: Deploys all metadata bundles under unpackaged/post/
2019-04-19 07:25:54: 3.2: config_apextest.update_admin_profile: Retrieves, edits, and redeploys the Admin.profile with full FLS perms for all objects/fields
2019-04-19 07:25:54: 4: run_tests: Runs all apex tests
2019-04-19 07:25:54: 5: github_parent_to_children: Merges the latest commit on a parent feature branch into all child feature branches
2019-04-19 07:25:54: ------------------------------------------------------------
2019-04-19 07:25:54: 
2019-04-19 07:25:54: Starting execution
2019-04-19 07:25:54: ============================================================
2019-04-19 07:25:54: 
2019-04-19 07:25:54: ------------------------------------------------------------
2019-04-19 07:25:54: Running task: update_dependencies
2019-04-19 07:25:54: ------------------------------------------------------------
2019-04-19 07:25:54: 
2019-04-19 07:25:54: Options:
2019-04-19 07:25:54:   dependencies: [OrderedDict([('github', 'https://github.com/SalesforceFoundation/Households')]), OrderedDict([('github', 'https://github.com/SalesforceFoundation/Recurring_Donations')]), OrderedDict([('github', 'https://github.com/SalesforceFoundation/Relationships')]), OrderedDict([('github', 'https://github.com/SalesforceFoundation/Affiliations')])]
2019-04-19 07:25:54:   namespaced_org: False
2019-04-19 07:25:54:   purge_on_delete: True
2019-04-19 07:25:54:   include_beta: True
2019-04-19 07:25:54: Beginning task: UpdateDependencies
2019-04-19 07:25:54: 
2019-04-19 07:25:54: Preparing static dependencies map
2019-04-19 07:25:54: Processing dependencies from Github repo https://github.com/SalesforceFoundation/Households
2019-04-19 07:25:55: Processing dependencies from Github repo https://github.com/SalesforceFoundation/Contacts_and_Organizations
2019-04-19 07:25:56: Processing dependencies from Github repo https://github.com/SalesforceFoundation/Recurring_Donations
2019-04-19 07:25:57: Processing dependencies from Github repo https://github.com/SalesforceFoundation/Relationships
2019-04-19 07:25:57: Processing dependencies from Github repo https://github.com/SalesforceFoundation/Affiliations
2019-04-19 07:25:58: Dependencies:
2019-04-19 07:25:58:   - dependencies: 
    
2019-04-19 07:25:58:       - name: Install Contacts & Organizations 3.12 (Beta 2)
2019-04-19 07:25:58:         namespace: npe01
2019-04-19 07:25:58:         version: 3.12 (Beta 2)
2019-04-19 07:25:58:     name: Install Households 3.12 (Beta 1)
2019-04-19 07:25:58:     namespace: npo02
2019-04-19 07:25:58:     version: 3.12 (Beta 1)
2019-04-19 07:25:58:   - name: Install Recurring Donations 3.13
2019-04-19 07:25:58:     namespace: npe03
2019-04-19 07:25:58:     version: 3.13
2019-04-19 07:25:58:   - name: Install Relationships 3.8
2019-04-19 07:25:58:     namespace: npe4
2019-04-19 07:25:58:     version: 3.8
2019-04-19 07:25:58:   - name: Install Affiliations 3.8 (Beta 25)
2019-04-19 07:25:58:     namespace: npe5
2019-04-19 07:25:58:     version: 3.8 (Beta 25)
2019-04-19 07:25:58: Retrieving list of packages from target org
2019-04-19 07:25:58: Pending
2019-04-19 07:25:59: [Done]
2019-04-19 07:26:00:   npe01: Install version 3.12 (Beta 2)
2019-04-19 07:26:00:   npo02: Install version 3.12 (Beta 1)
2019-04-19 07:26:00:   npe03: Install version 3.13
2019-04-19 07:26:00:   npe4: Install version 3.8
2019-04-19 07:26:00:   npe5: Install version 3.8 (Beta 25)
2019-04-19 07:26:00: Installing npe01 version 3.12 (Beta 2)
2019-04-19 07:26:00: Pending
2019-04-19 07:26:00: [InProgress]: Processing Type: InstalledPackage
2019-04-19 07:26:02: [InProgress]: Processing Type: InstalledPackage
2019-04-19 07:26:03: [InProgress]: Processing Type: InstalledPackage
2019-04-19 07:26:04: [InProgress]: Processing Type: InstalledPackage
2019-04-19 07:26:06: [InProgress]: Processing Type: InstalledPackage
2019-04-19 07:26:07: [InProgress]: Processing Type: InstalledPackage
2019-04-19 07:26:08: [InProgress]: Processing Type: InstalledPackage
2019-04-19 07:26:10: [InProgress]: Processing Type: InstalledPackage
2019-04-19 07:26:11: [InProgress]: Processing Type: InstalledPackage
2019-04-19 07:26:12: [InProgress]: Processing Type: InstalledPackage
2019-04-19 07:26:13: [InProgress]: Processing Type: InstalledPackage
2019-04-19 07:26:15: [InProgress]: Processing Type: InstalledPackage
2019-04-19 07:26:16: [InProgress]: Processing Type: InstalledPackage
2019-04-19 07:26:17: [InProgress]: Processing Type: InstalledPackage
2019-04-19 07:26:19: [InProgress]: Processing Type: InstalledPackage
2019-04-19 07:26:20: [InProgress]: Processing Type: InstalledPackage
2019-04-19 07:26:21: [InProgress]: Processing Type: InstalledPackage
2019-04-19 07:26:22: [InProgress]: Processing Type: InstalledPackage
2019-04-19 07:26:24: [InProgress]: Processing Type: InstalledPackage
2019-04-19 07:26:25: [InProgress]: Processing Type: InstalledPackage
2019-04-19 07:26:26: [InProgress]: Processing Type: InstalledPackage
2019-04-19 07:26:28: [InProgress]: Processing Type: InstalledPackage
2019-04-19 07:26:29: [InProgress]: Processing Type: InstalledPackage
2019-04-19 07:26:30: [Done]
2019-04-19 07:26:31: [Success]: Succeeded
2019-04-19 07:26:31: Installing npo02 version 3.12 (Beta 1)
2019-04-19 07:26:31: Pending
2019-04-19 07:26:32: [Pending]: next check in 1 seconds
2019-04-19 07:26:33: [Pending]: next check in 1 seconds
2019-04-19 07:26:35: [Pending]: next check in 2 seconds
2019-04-19 07:26:37: [Pending]: next check in 2 seconds
2019-04-19 07:26:39: [Pending]: next check in 2 seconds
2019-04-19 07:26:41: [Pending]: next check in 3 seconds
2019-04-19 07:26:45: [Pending]: next check in 3 seconds
2019-04-19 07:26:48: [Pending]: next check in 3 seconds
2019-04-19 07:26:52: [Pending]: next check in 4 seconds
2019-04-19 07:26:56: [Pending]: next check in 4 seconds
2019-04-19 07:27:00: [Pending]: next check in 4 seconds
2019-04-19 07:27:04: [Pending]: next check in 5 seconds
2019-04-19 07:27:10: [InProgress]: Processing Type: InstalledPackage
2019-04-19 07:27:11: [InProgress]: Processing Type: InstalledPackage
2019-04-19 07:27:12: [InProgress]: Processing Type: InstalledPackage
2019-04-19 07:27:14: [InProgress]: Processing Type: InstalledPackage
2019-04-19 07:27:15: [InProgress]: Processing Type: InstalledPackage
2019-04-19 07:27:16: [InProgress]: Processing Type: InstalledPackage
2019-04-19 07:27:17: [InProgress]: Processing Type: InstalledPackage
2019-04-19 07:27:20: [InProgress]: Processing Type: InstalledPackage
2019-04-19 07:27:21: [InProgress]: Processing Type: InstalledPackage
2019-04-19 07:27:22: [InProgress]: Processing Type: InstalledPackage
2019-04-19 07:27:24: [InProgress]: Processing Type: InstalledPackage
2019-04-19 07:27:25: [InProgress]: Processing Type: InstalledPackage
2019-04-19 07:27:26: [InProgress]: Processing Type: InstalledPackage
2019-04-19 07:27:27: [InProgress]: Processing Type: InstalledPackage
2019-04-19 07:27:29: [InProgress]: Processing Type: InstalledPackage
2019-04-19 07:27:30: [InProgress]: Processing Type: InstalledPackage
2019-04-19 07:27:32: [InProgress]: Processing Type: InstalledPackage
2019-04-19 07:27:33: [InProgress]: Processing Type: InstalledPackage
2019-04-19 07:27:34: [InProgress]: Processing Type: InstalledPackage
2019-04-19 07:27:35: [InProgress]: Processing Type: InstalledPackage
2019-04-19 07:27:37: [InProgress]: Processing Type: InstalledPackage
2019-04-19 07:27:38: [InProgress]: Processing Type: InstalledPackage
2019-04-19 07:27:39: [InProgress]: Processing Type: InstalledPackage
2019-04-19 07:27:41: [InProgress]: Processing Type: InstalledPackage
2019-04-19 07:27:42: [InProgress]: Processing Type: InstalledPackage
2019-04-19 07:27:43: [InProgress]: Processing Type: InstalledPackage
2019-04-19 07:27:44: [Done]
2019-04-19 07:27:45: [Success]: Succeeded
2019-04-19 07:27:45: Installing npe03 version 3.13
2019-04-19 07:27:45: Pending
2019-04-19 07:27:46: [Pending]: next check in 1 seconds
2019-04-19 07:27:47: [InProgress]: Processing Type: InstalledPackage
2019-04-19 07:27:49: [InProgress]: Processing Type: InstalledPackage
2019-04-19 07:27:50: [InProgress]: Processing Type: InstalledPackage
2019-04-19 07:27:51: [InProgress]: Processing Type: InstalledPackage
2019-04-19 07:27:53: [InProgress]: Processing Type: InstalledPackage
2019-04-19 07:27:54: [InProgress]: Processing Type: InstalledPackage
2019-04-19 07:27:56: [InProgress]: Processing Type: InstalledPackage
2019-04-19 07:27:57: [InProgress]: Processing Type: InstalledPackage
2019-04-19 07:27:58: [InProgress]: Processing Type: InstalledPackage
2019-04-19 07:28:00: [InProgress]: Processing Type: InstalledPackage
2019-04-19 07:28:01: [InProgress]: Processing Type: InstalledPackage
2019-04-19 07:28:02: [InProgress]: Processing Type: InstalledPackage
2019-04-19 07:28:04: [InProgress]: Processing Type: InstalledPackage
2019-04-19 07:28:05: [InProgress]: Processing Type: InstalledPackage
2019-04-19 07:28:06: [Done]
2019-04-19 07:28:07: [Success]: Succeeded
2019-04-19 07:28:07: Installing npe4 version 3.8
2019-04-19 07:28:07: Pending
2019-04-19 07:28:08: [Pending]: next check in 1 seconds
2019-04-19 07:28:09: [InProgress]: Processing Type: InstalledPackage
2019-04-19 07:28:10: [InProgress]: Processing Type: InstalledPackage
2019-04-19 07:28:12: [InProgress]: Processing Type: InstalledPackage
2019-04-19 07:28:13: [InProgress]: Processing Type: InstalledPackage
2019-04-19 07:28:14: [InProgress]: Processing Type: InstalledPackage
2019-04-19 07:28:16: [InProgress]: Processing Type: InstalledPackage
2019-04-19 07:28:17: [InProgress]: Processing Type: InstalledPackage
2019-04-19 07:28:18: [InProgress]: Processing Type: InstalledPackage
2019-04-19 07:28:20: [InProgress]: Processing Type: InstalledPackage
2019-04-19 07:28:21: [InProgress]: Processing Type: InstalledPackage
2019-04-19 07:28:22: [InProgress]: Processing Type: InstalledPackage
2019-04-19 07:28:23: [InProgress]: Processing Type: InstalledPackage
2019-04-19 07:28:25: [InProgress]: Processing Type: InstalledPackage
2019-04-19 07:28:26: [InProgress]: Processing Type: InstalledPackage
2019-04-19 07:28:27: [Done]
2019-04-19 07:28:28: [Success]: Succeeded
2019-04-19 07:28:28: Installing npe5 version 3.8 (Beta 25)
2019-04-19 07:28:28: Pending
2019-04-19 07:28:29: [Pending]: next check in 1 seconds
2019-04-19 07:28:30: [InProgress]: Processing Type: InstalledPackage
2019-04-19 07:28:31: [InProgress]: Processing Type: InstalledPackage
2019-04-19 07:28:33: [InProgress]: Processing Type: InstalledPackage
2019-04-19 07:28:34: [InProgress]: Processing Type: InstalledPackage
2019-04-19 07:28:35: [InProgress]: Processing Type: InstalledPackage
2019-04-19 07:28:37: [InProgress]: Processing Type: InstalledPackage
2019-04-19 07:28:38: [InProgress]: Processing Type: InstalledPackage
2019-04-19 07:28:39: [InProgress]: Processing Type: InstalledPackage
2019-04-19 07:28:41: [InProgress]: Processing Type: InstalledPackage
2019-04-19 07:28:42: [InProgress]: Processing Type: InstalledPackage
2019-04-19 07:28:43: [InProgress]: Processing Type: InstalledPackage
2019-04-19 07:28:45: [Done]
2019-04-19 07:28:46: [Success]: Succeeded
2019-04-19 07:28:46: ------------------------------------------------------------
2019-04-19 07:28:46: Running task: deploy_pre
2019-04-19 07:28:46: ------------------------------------------------------------
2019-04-19 07:28:46: 
2019-04-19 07:28:46: Options:
2019-04-19 07:28:46:   path: unpackaged/pre
2019-04-19 07:28:46: Beginning task: DeployBundles
2019-04-19 07:28:46: 
2019-04-19 07:28:46: Deploying all metadata bundles in path /tmp/tmp18ujsa8n/SalesforceFoundation-Cumulus-4763744/unpackaged/pre
2019-04-19 07:28:46: Deploying bundle: unpackaged/pre/account_record_types
2019-04-19 07:28:46: Cleaning meta.xml files of packageVersion elements for deploy
2019-04-19 07:28:46: Payload size: 872 bytes
2019-04-19 07:28:46: Pending
2019-04-19 07:28:46: [InProgress]: Processing Type: CustomObject
2019-04-19 07:28:48: [InProgress]: Processing Type: CustomObject
2019-04-19 07:28:49: [Done]
2019-04-19 07:28:50: [Success]: Succeeded
2019-04-19 07:28:50: Deploying bundle: unpackaged/pre/opportunity_record_types
2019-04-19 07:28:50: Cleaning meta.xml files of packageVersion elements for deploy
2019-04-19 07:28:50: Payload size: 1016 bytes
2019-04-19 07:28:50: Pending
2019-04-19 07:28:51: [InProgress]: Processing Type: CustomObject
2019-04-19 07:28:52: [InProgress]: Processing Type: CustomObject
2019-04-19 07:28:53: [Done]
2019-04-19 07:28:54: [Success]: Succeeded
2019-04-19 07:28:55: ------------------------------------------------------------
2019-04-19 07:28:55: Running task: unschedule_apex
2019-04-19 07:28:55: ------------------------------------------------------------
2019-04-19 07:28:55: 
2019-04-19 07:28:55: Options:
2019-04-19 07:28:55:   apex: for (CronTrigger t : [SELECT Id FROM CronTrigger]) { System.abortJob(t.Id); }
2019-04-19 07:28:55: Beginning task: AnonymousApexTask
2019-04-19 07:28:55: 
2019-04-19 07:28:55: Executing anonymous Apex
2019-04-19 07:28:55: Anonymous Apex Success
2019-04-19 07:28:55: ------------------------------------------------------------
2019-04-19 07:28:55: Running task: update_package_xml
2019-04-19 07:28:55: ------------------------------------------------------------
2019-04-19 07:28:55: 
2019-04-19 07:28:55: Options:
2019-04-19 07:28:55:   path: src
2019-04-19 07:28:55:   managed: False
2019-04-19 07:28:55: Beginning task: UpdatePackageXml
2019-04-19 07:28:55: 
2019-04-19 07:28:55: Generating src/package.xml from metadata in src
2019-04-19 07:28:56: ------------------------------------------------------------
2019-04-19 07:28:56: Running task: deploy
2019-04-19 07:28:56: ------------------------------------------------------------
2019-04-19 07:28:56: 
2019-04-19 07:28:56: Options:
2019-04-19 07:28:56:   path: src
2019-04-19 07:28:56: Beginning task: Deploy
2019-04-19 07:28:56: 
2019-04-19 07:28:57: Cleaning meta.xml files of packageVersion elements for deploy
2019-04-19 07:28:58: Cleaned package versions from 614 meta.xml files
2019-04-19 07:28:58: Payload size: 6370764 bytes
2019-04-19 07:28:58: Pending
2019-04-19 07:29:01: [Pending]: next check in 1 seconds
2019-04-19 07:29:02: [InProgress]: Processing Type: CustomLabels
2019-04-19 07:29:03: [InProgress]: Processing Type: CustomLabels
2019-04-19 07:29:05: [InProgress]: Processing Type: CustomLabels
2019-04-19 07:29:06: [InProgress]: Processing Type: CustomLabels
2019-04-19 07:29:07: [InProgress]: Processing Type: AuraDefinitionBundle
2019-04-19 07:29:09: [InProgress]: Processing Type: AuraDefinitionBundle
2019-04-19 07:29:10: [InProgress]: Processing Type: AuraDefinitionBundle
2019-04-19 07:29:11: [InProgress]: Processing Type: ApexComponent
2019-04-19 07:29:13: [InProgress]: Processing Type: ApexPage
2019-04-19 07:29:14: [InProgress]: Processing Type: ApexPage
2019-04-19 07:29:15: [InProgress]: Processing Type: ApexPage
2019-04-19 07:29:16: [InProgress]: Processing Type: ApexPage
2019-04-19 07:29:18: [InProgress]: Processing Type: ApexPage
2019-04-19 07:29:19: [InProgress]: Processing Type: ApexPage
2019-04-19 07:29:20: [InProgress]: Processing Type: ApexPage
2019-04-19 07:29:22: [InProgress]: Processing Type: CustomObject
2019-04-19 07:29:23: [InProgress]: Processing Type: CustomObject
2019-04-19 07:29:24: [InProgress]: Processing Type: CustomObject
2019-04-19 07:29:26: [InProgress]: Processing Type: CustomObject
2019-04-19 07:29:27: [InProgress]: Processing Type: CustomObject
2019-04-19 07:29:28: [InProgress]: Processing Type: CustomObject
2019-04-19 07:29:29: [InProgress]: Processing Type: CustomObject
2019-04-19 07:29:31: [InProgress]: Processing Type: CustomObject
2019-04-19 07:29:32: [InProgress]: next check in 1 seconds
2019-04-19 07:29:33: [InProgress]: next check in 1 seconds
2019-04-19 07:29:35: [InProgress]: next check in 1 seconds
2019-04-19 07:29:36: [InProgress]: next check in 1 seconds
2019-04-19 07:29:37: [InProgress]: next check in 1 seconds
2019-04-19 07:29:39: [InProgress]: next check in 1 seconds
2019-04-19 07:29:40: [InProgress]: next check in 1 seconds
2019-04-19 07:29:41: [InProgress]: next check in 1 seconds
2019-04-19 07:29:43: [InProgress]: Processing Type: ReportType
2019-04-19 07:29:44: [InProgress]: Processing Type: Report
2019-04-19 07:29:46: [InProgress]: Processing Type: Layout
2019-04-19 07:29:47: [InProgress]: Processing Type: Layout
2019-04-19 07:29:49: [InProgress]: Processing Type: Layout
2019-04-19 07:29:50: [InProgress]: Processing Type: Layout
2019-04-19 07:29:52: [InProgress]: Processing Type: QuickAction
2019-04-19 07:29:53: [InProgress]: Processing Type: Workflow
2019-04-19 07:29:55: [InProgress]: Processing Type: Workflow
2019-04-19 07:29:57: [InProgress]: Processing Type: CustomObjectTranslation
2019-04-19 07:29:58: [InProgress]: Processing Type: CustomObjectTranslation
2019-04-19 07:30:00: [InProgress]: Processing Type: CustomObjectTranslation
2019-04-19 07:30:01: [InProgress]: Processing Type: CustomObjectTranslation
2019-04-19 07:30:03: [InProgress]: Processing Type: CustomObjectTranslation
2019-04-19 07:30:04: [InProgress]: Processing Type: Translations
2019-04-19 07:30:06: [InProgress]: Processing Type: ApexClass
2019-04-19 07:30:07: [InProgress]: Processing Type: ApexClass
2019-04-19 07:30:09: [InProgress]: Processing Type: ApexClass
2019-04-19 07:30:11: [InProgress]: Processing Type: ApexClass
2019-04-19 07:30:12: [InProgress]: Processing Type: ApexClass
2019-04-19 07:30:14: [InProgress]: Processing Type: ApexClass
2019-04-19 07:30:15: [InProgress]: Processing Type: ApexClass
2019-04-19 07:30:17: [InProgress]: Processing Type: ApexClass
2019-04-19 07:30:18: [InProgress]: Processing Type: ApexClass
2019-04-19 07:30:20: [InProgress]: Processing Type: ApexClass
2019-04-19 07:30:22: [InProgress]: Processing Type: ApexClass
2019-04-19 07:30:23: [InProgress]: Processing Type: ApexClass
2019-04-19 07:30:25: [InProgress]: Processing Type: ApexClass
2019-04-19 07:30:27: [InProgress]: Processing Type: ApexClass
2019-04-19 07:30:28: [InProgress]: Processing Type: ApexClass
2019-04-19 07:30:30: [InProgress]: Processing Type: ApexClass
2019-04-19 07:30:31: [InProgress]: Processing Type: ApexClass
2019-04-19 07:30:33: [InProgress]: Processing Type: ApexClass
2019-04-19 07:30:34: [InProgress]: Processing Type: ApexClass
2019-04-19 07:30:36: [InProgress]: Processing Type: ApexClass
2019-04-19 07:30:38: [InProgress]: Processing Type: ApexClass
2019-04-19 07:30:39: [InProgress]: Processing Type: ApexClass
2019-04-19 07:30:41: [InProgress]: Processing Type: ApexClass
2019-04-19 07:30:43: [InProgress]: Processing Type: ApexClass
2019-04-19 07:30:45: [InProgress]: Processing Type: ApexClass
2019-04-19 07:30:46: [InProgress]: Processing Type: ApexClass
2019-04-19 07:30:48: [InProgress]: Processing Type: ApexClass
2019-04-19 07:30:49: [InProgress]: Processing Type: ApexClass
2019-04-19 07:30:51: [InProgress]: Processing Type: ApexClass
2019-04-19 07:30:53: [InProgress]: Processing Type: ApexClass
2019-04-19 07:30:54: [InProgress]: Processing Type: ApexClass
2019-04-19 07:30:56: [InProgress]: Processing Type: ApexTrigger
2019-04-19 07:30:58: [InProgress]: Processing Type: ApexTrigger
2019-04-19 07:31:00: [InProgress]: Processing Type: CustomMetadata
2019-04-19 07:31:02: [InProgress]: Processing Type: MatchingRules
2019-04-19 07:31:04: [InProgress]: Processing Type: MatchingRules
2019-04-19 07:31:06: [InProgress]: Processing Type: MatchingRules
2019-04-19 07:31:08: [InProgress]: Processing Type: MatchingRules
2019-04-19 07:31:10: [InProgress]: Processing Type: MatchingRules
2019-04-19 07:31:12: [InProgress]: Processing Type: MatchingRules
2019-04-19 07:31:15: [InProgress]: Processing Type: MatchingRules
2019-04-19 07:31:17: [InProgress]: Processing Type: MatchingRules
2019-04-19 07:31:20: [InProgress]: Processing Type: MatchingRules
2019-04-19 07:31:23: [InProgress]: Processing Type: MatchingRules
2019-04-19 07:31:26: [InProgress]: Processing Type: MatchingRules
2019-04-19 07:31:29: [InProgress]: Processing Type: MatchingRules
2019-04-19 07:31:32: [InProgress]: Processing Type: MatchingRules
2019-04-19 07:31:35: [InProgress]: Processing Type: MatchingRules
2019-04-19 07:31:38: [InProgress]: Processing Type: MatchingRules
2019-04-19 07:31:41: [InProgress]: Processing Type: MatchingRules
2019-04-19 07:31:44: [InProgress]: Processing Type: MatchingRules
2019-04-19 07:31:47: [InProgress]: next check in 1 seconds
2019-04-19 07:31:50: [Done]
2019-04-19 07:31:52: [Success]: Succeeded
2019-04-19 07:31:52: ------------------------------------------------------------
2019-04-19 07:31:52: Running task: uninstall_packaged_incremental
2019-04-19 07:31:52: ------------------------------------------------------------
2019-04-19 07:31:52: 
2019-04-19 07:31:52: Options:
2019-04-19 07:31:52:   path: /tmp/tmp18ujsa8n/SalesforceFoundation-Cumulus-4763744/src
2019-04-19 07:31:52:   package: Cumulus
2019-04-19 07:31:52:   purge_on_delete: True
2019-04-19 07:31:52:   ignore: OrderedDict([('QuickAction', ['NewEvent', 'NewCase', 'SendEmail']), ('FlexiPage', ['NPSP_Address_Record_Page', 'NPSP_Deliverable', 'NPSP_Engagement_Plan_Record_Page', 'NPSP_GAU_Allocation', 'NPSP_General_Accounting_Unit'])])
2019-04-19 07:31:52: Beginning task: UninstallPackagedIncremental
2019-04-19 07:31:52: 
2019-04-19 07:31:52: Retrieving metadata in package Cumulus from target org
2019-04-19 07:31:52: Pending
2019-04-19 07:31:52: [Pending]: next check in 1 seconds
2019-04-19 07:31:54: [Pending]: next check in 1 seconds
2019-04-19 07:31:55: [Pending]: next check in 2 seconds
2019-04-19 07:31:57: [Pending]: next check in 2 seconds
2019-04-19 07:32:00: [Pending]: next check in 2 seconds
2019-04-19 07:32:02: [Pending]: next check in 3 seconds
2019-04-19 07:32:05: [Pending]: next check in 3 seconds
2019-04-19 07:32:09: [Pending]: next check in 3 seconds
2019-04-19 07:32:12: [Pending]: next check in 4 seconds
2019-04-19 07:32:16: [Done]
2019-04-19 07:32:24: No metadata found to delete
2019-04-19 07:32:24: ------------------------------------------------------------
2019-04-19 07:32:24: Running task: deploy_post
2019-04-19 07:32:24: ------------------------------------------------------------
2019-04-19 07:32:24: 
2019-04-19 07:32:24: Options:
2019-04-19 07:32:24:   path: unpackaged/post
2019-04-19 07:32:24:   unmanaged: False
2019-04-19 07:32:24:   namespace_inject: npsp
2019-04-19 07:32:24:   namespaced_org: True
2019-04-19 07:32:24: Beginning task: DeployBundles
2019-04-19 07:32:24: 
2019-04-19 07:32:24: Deploying all metadata bundles in path /tmp/tmp18ujsa8n/SalesforceFoundation-Cumulus-4763744/unpackaged/post
2019-04-19 07:32:24: Deploying bundle: unpackaged/post/first
2019-04-19 07:32:24: Replacing namespace tokens from metadata with namespace prefix npsp__
2019-04-19 07:32:24:   objects/Account.object: Replaced %%%NAMESPACE%%% with "npsp"
2019-04-19 07:32:24:   layouts/Global-Global Layout.layout: Replaced %%%NAMESPACE%%% with "npsp"
2019-04-19 07:32:24: Cleaning meta.xml files of packageVersion elements for deploy
2019-04-19 07:32:24: Payload size: 3184 bytes
2019-04-19 07:32:24: Pending
2019-04-19 07:32:25: [InProgress]: Processing Type: CustomObject
2019-04-19 07:32:26: [InProgress]: Processing Type: CustomObject
2019-04-19 07:32:28: [Done]
2019-04-19 07:32:29: [Success]: Succeeded
2019-04-19 07:32:29: ------------------------------------------------------------
2019-04-19 07:32:29: Running task: update_admin_profile
2019-04-19 07:32:29: ------------------------------------------------------------
2019-04-19 07:32:29: 
2019-04-19 07:32:29: Options:
2019-04-19 07:32:29:   package_xml: lib/admin_profile.xml
2019-04-19 07:32:29:   record_types: [OrderedDict([('record_type', 'Account.HH_Account')]), OrderedDict([('record_type', 'Account.Organization'), ('default', True), ('person_account_default', True)]), OrderedDict([('record_type', 'Opportunity.NPSP_Default'), ('default', True)])]
2019-04-19 07:32:29:   managed: False
2019-04-19 07:32:29:   namespaced_org: False
2019-04-19 07:32:29: Beginning task: UpdateAdminProfile
2019-04-19 07:32:29: 
2019-04-19 07:32:29: Retrieving metadata using lib/admin_profile.xml
2019-04-19 07:32:29: Pending
2019-04-19 07:32:30: [Pending]: next check in 1 seconds
2019-04-19 07:32:31: [Pending]: next check in 1 seconds
2019-04-19 07:32:33: [Pending]: next check in 2 seconds
2019-04-19 07:32:35: [Pending]: next check in 2 seconds
2019-04-19 07:32:37: [Pending]: next check in 2 seconds
2019-04-19 07:32:39: [Done]
2019-04-19 07:32:43: Processing retrieved metadata in /tmp/tmpcyc92r_b
2019-04-19 07:32:44: Deploying updated Admin.profile from /tmp/tmpcyc92r_b
2019-04-19 07:32:44: Cleaning meta.xml files of packageVersion elements for deploy
2019-04-19 07:32:44: Payload size: 145312 bytes
2019-04-19 07:32:44: Pending
2019-04-19 07:32:45: [InProgress]: Processing Type: CustomObject
2019-04-19 07:32:46: [InProgress]: Processing Type: CustomObject
2019-04-19 07:32:47: [InProgress]: Processing Type: CustomObject
2019-04-19 07:32:49: [InProgress]: Processing Type: CustomObject
2019-04-19 07:32:50: [InProgress]: Processing Type: CustomObject
2019-04-19 07:32:51: [InProgress]: Processing Type: CustomObject
2019-04-19 07:32:53: [InProgress]: Processing Type: CustomObject
2019-04-19 07:32:54: [InProgress]: Processing Type: CustomObject
2019-04-19 07:32:55: [InProgress]: next check in 1 seconds
2019-04-19 07:32:57: [InProgress]: Processing Type: Profile
2019-04-19 07:32:58: [InProgress]: Processing Type: Profile
2019-04-19 07:33:00: [InProgress]: Processing Type: Profile
2019-04-19 07:33:02: [Done]
2019-04-19 07:33:04: [Success]: Succeeded
2019-04-19 07:33:04: ------------------------------------------------------------
2019-04-19 07:33:04: Running task: run_tests
2019-04-19 07:33:04: ------------------------------------------------------------
2019-04-19 07:33:04: 
2019-04-19 07:33:04: Options:
2019-04-19 07:33:04:   test_name_match: %_TEST%
2019-04-19 07:33:04:   test_name_exclude: 
2019-04-19 07:33:04:   namespace: npsp
2019-04-19 07:33:04:   managed: True
2019-04-19 07:33:04:   retries: 10
2019-04-19 07:33:04:   retry_interval: 5
2019-04-19 07:33:04:   retry_interval_add: 5
2019-04-19 07:33:04:   junit_output: test_results.xml
2019-04-19 07:33:04:   json_output: test_results.json
2019-04-19 07:33:04: Beginning task: RunApexTests
2019-04-19 07:33:04: 
2019-04-19 07:33:04: Running query: SELECT Id, Name FROM ApexClass WHERE NamespacePrefix = 'npsp' AND (Name LIKE '%_TEST%')
2019-04-19 07:33:04: Found 172 test classes
2019-04-19 07:33:04: Queuing tests for execution...
2019-04-19 07:33:06: Completed: 0  Processing: 1  Queued: 171
2019-04-19 07:33:07: Completed: 0  Processing: 32  Queued: 140
2019-04-19 07:33:08: Completed: 5  Processing: 27  Queued: 140
2019-04-19 07:33:09: Increased polling interval to 2 seconds
2019-04-19 07:33:10: Completed: 11  Processing: 21  Queued: 140
2019-04-19 07:33:12: Completed: 19  Processing: 14  Queued: 139
2019-04-19 07:33:14: Completed: 24  Processing: 9  Queued: 139
2019-04-19 07:33:16: Increased polling interval to 3 seconds
2019-04-19 07:33:16: Completed: 26  Processing: 7  Queued: 139
2019-04-19 07:33:19: Completed: 27  Processing: 6  Queued: 139
2019-04-19 07:33:22: Completed: 27  Processing: 7  Queued: 138
2019-04-19 07:33:25: Increased polling interval to 4 seconds
2019-04-19 07:33:25: Completed: 27  Processing: 7  Queued: 138
2019-04-19 07:33:29: Completed: 30  Processing: 6  Queued: 136
2019-04-19 07:33:33: Completed: 31  Processing: 5  Queued: 136
2019-04-19 07:33:37: Increased polling interval to 5 seconds
2019-04-19 07:33:38: Completed: 32  Processing: 5  Queued: 135
2019-04-19 07:33:43: Completed: 36  Processing: 4  Queued: 132
2019-04-19 07:33:48: Completed: 36  Processing: 4  Queued: 132
2019-04-19 07:33:53: Increased polling interval to 6 seconds
2019-04-19 07:33:53: Completed: 37  Processing: 3  Queued: 132
2019-04-19 07:33:59: Completed: 38  Processing: 2  Queued: 132
2019-04-19 07:34:05: Completed: 39  Processing: 1  Queued: 132
2019-04-19 07:34:11: Increased polling interval to 7 seconds
2019-04-19 07:34:11: Completed: 39  Processing: 1  Queued: 132
2019-04-19 07:34:18: Completed: 41  Processing: 1  Queued: 130
2019-04-19 07:34:25: Completed: 43  Processing: 1  Queued: 128
2019-04-19 07:34:32: Increased polling interval to 8 seconds
2019-04-19 07:34:32: Completed: 43  Processing: 1  Queued: 128
2019-04-19 07:34:41: Completed: 45  Processing: 1  Queued: 126
2019-04-19 07:34:49: Completed: 46  Processing: 1  Queued: 125
2019-04-19 07:34:57: Increased polling interval to 9 seconds
2019-04-19 07:34:57: Completed: 47  Processing: 1  Queued: 124
2019-04-19 07:35:06: Completed: 48  Processing: 1  Queued: 123
2019-04-19 07:35:15: Completed: 48  Processing: 1  Queued: 123
2019-04-19 07:35:24: Increased polling interval to 10 seconds
2019-04-19 07:35:24: Completed: 48  Processing: 1  Queued: 123
2019-04-19 07:35:35: Completed: 48  Processing: 1  Queued: 123
2019-04-19 07:35:45: Completed: 49  Processing: 1  Queued: 122
2019-04-19 07:35:55: Increased polling interval to 11 seconds
2019-04-19 07:35:55: Completed: 50  Processing: 1  Queued: 121
2019-04-19 07:36:06: Completed: 53  Processing: 1  Queued: 118
2019-04-19 07:36:17: Completed: 53  Processing: 1  Queued: 118
2019-04-19 07:36:28: Increased polling interval to 12 seconds
2019-04-19 07:36:28: Completed: 53  Processing: 1  Queued: 118
2019-04-19 07:36:40: Completed: 53  Processing: 1  Queued: 118
2019-04-19 07:36:53: Completed: 54  Processing: 1  Queued: 117
2019-04-19 07:37:05: Increased polling interval to 13 seconds
2019-04-19 07:37:05: Completed: 54  Processing: 1  Queued: 117
2019-04-19 07:37:18: Completed: 54  Processing: 1  Queued: 117
2019-04-19 07:37:31: Completed: 54  Processing: 1  Queued: 117
2019-04-19 07:37:44: Increased polling interval to 14 seconds
2019-04-19 07:37:44: Completed: 55  Processing: 1  Queued: 116
2019-04-19 07:37:58: Completed: 56  Processing: 1  Queued: 115
2019-04-19 07:38:12: Completed: 56  Processing: 1  Queued: 115
2019-04-19 07:38:26: Increased polling interval to 15 seconds
2019-04-19 07:38:26: Completed: 57  Processing: 1  Queued: 114
2019-04-19 07:38:42: Completed: 60  Processing: 1  Queued: 111
2019-04-19 07:38:57: Completed: 60  Processing: 1  Queued: 111
2019-04-19 07:39:12: Increased polling interval to 16 seconds
2019-04-19 07:39:12: Completed: 60  Processing: 1  Queued: 111
2019-04-19 07:39:28: Completed: 60  Processing: 1  Queued: 111
2019-04-19 07:39:44: Completed: 60  Processing: 1  Queued: 111
2019-04-19 07:40:00: Increased polling interval to 17 seconds
2019-04-19 07:40:00: Completed: 60  Processing: 1  Queued: 111
2019-04-19 07:40:17: Completed: 60  Processing: 1  Queued: 111
2019-04-19 07:40:34: Completed: 60  Processing: 1  Queued: 111
2019-04-19 07:40:51: Increased polling interval to 18 seconds
2019-04-19 07:40:52: Completed: 62  Processing: 1  Queued: 109
2019-04-19 07:41:10: Completed: 64  Processing: 1  Queued: 107
2019-04-19 07:41:28: Completed: 66  Processing: 0  Queued: 106
2019-04-19 07:41:46: Increased polling interval to 19 seconds
2019-04-19 07:41:46: Completed: 68  Processing: 1  Queued: 103
2019-04-19 07:42:05: Completed: 68  Processing: 1  Queued: 103
2019-04-19 07:42:24: Completed: 70  Processing: 1  Queued: 101
2019-04-19 07:42:43: Increased polling interval to 20 seconds
2019-04-19 07:42:43: Completed: 73  Processing: 1  Queued: 98
2019-04-19 07:43:04: Completed: 73  Processing: 1  Queued: 98
2019-04-19 07:43:24: Completed: 73  Processing: 1  Queued: 98
2019-04-19 07:43:44: Increased polling interval to 21 seconds
2019-04-19 07:43:44: Completed: 74  Processing: 1  Queued: 97
2019-04-19 07:44:05: Completed: 75  Processing: 0  Queued: 97
2019-04-19 07:44:26: Completed: 75  Processing: 0  Queued: 97
2019-04-19 07:44:47: Increased polling interval to 22 seconds
2019-04-19 07:44:47: Completed: 75  Processing: 1  Queued: 96
2019-04-19 07:45:09: Completed: 76  Processing: 1  Queued: 95
2019-04-19 07:45:31: Completed: 81  Processing: 1  Queued: 90
2019-04-19 07:45:53: Increased polling interval to 23 seconds
2019-04-19 07:45:54: Completed: 85  Processing: 1  Queued: 86
2019-04-19 07:46:17: Completed: 89  Processing: 1  Queued: 82
2019-04-19 07:46:40: Completed: 91  Processing: 1  Queued: 80
2019-04-19 07:47:03: Increased polling interval to 24 seconds
2019-04-19 07:47:03: Completed: 91  Processing: 1  Queued: 80
2019-04-19 07:47:27: Completed: 93  Processing: 1  Queued: 78
2019-04-19 07:47:51: Completed: 94  Processing: 0  Queued: 78
2019-04-19 07:48:15: Increased polling interval to 25 seconds
2019-04-19 07:48:15: Completed: 96  Processing: 1  Queued: 75
2019-04-19 07:48:41: Completed: 100  Processing: 1  Queued: 71
2019-04-19 07:49:06: Completed: 101  Processing: 1  Queued: 70
2019-04-19 07:49:31: Increased polling interval to 26 seconds
2019-04-19 07:49:31: Completed: 104  Processing: 1  Queued: 67
2019-04-19 07:49:57: Completed: 104  Processing: 1  Queued: 67
2019-04-19 07:50:23: Completed: 107  Processing: 1  Queued: 64
2019-04-19 07:50:49: Increased polling interval to 27 seconds
2019-04-19 07:50:49: Completed: 108  Processing: 1  Queued: 63
2019-04-19 07:51:16: Completed: 108  Processing: 1  Queued: 63
2019-04-19 07:51:44: Completed: 109  Processing: 1  Queued: 62
2019-04-19 07:52:11: Increased polling interval to 28 seconds
2019-04-19 07:52:11: Completed: 112  Processing: 1  Queued: 59
2019-04-19 07:52:39: Completed: 113  Processing: 1  Queued: 58
2019-04-19 07:53:07: Completed: 114  Processing: 1  Queued: 57
2019-04-19 07:53:35: Increased polling interval to 29 seconds
2019-04-19 07:53:35: Completed: 115  Processing: 1  Queued: 56
2019-04-19 07:54:04: Completed: 116  Processing: 1  Queued: 55
2019-04-19 07:54:33: Completed: 118  Processing: 1  Queued: 53
2019-04-19 07:55:02: Increased polling interval to 30 seconds
2019-04-19 07:55:03: Completed: 119  Processing: 1  Queued: 52
2019-04-19 07:55:33: Completed: 123  Processing: 1  Queued: 48
2019-04-19 07:56:03: Completed: 133  Processing: 1  Queued: 38
2019-04-19 07:56:33: Increased polling interval to 31 seconds
2019-04-19 07:56:33: Completed: 134  Processing: 1  Queued: 37
2019-04-19 07:57:04: Completed: 134  Processing: 1  Queued: 37
2019-04-19 07:57:35: Completed: 134  Processing: 1  Queued: 37
2019-04-19 07:58:06: Increased polling interval to 32 seconds
2019-04-19 07:58:06: Completed: 134  Processing: 1  Queued: 37
2019-04-19 07:58:39: Completed: 138  Processing: 1  Queued: 33
2019-04-19 07:59:11: Completed: 142  Processing: 0  Queued: 30
2019-04-19 07:59:43: Increased polling interval to 33 seconds
2019-04-19 07:59:43: Completed: 142  Processing: 1  Queued: 29
2019-04-19 08:00:16: Completed: 146  Processing: 0  Queued: 26
2019-04-19 08:00:49: Completed: 148  Processing: 1  Queued: 23
2019-04-19 08:01:22: Increased polling interval to 34 seconds
2019-04-19 08:01:22: Completed: 148  Processing: 1  Queued: 23
2019-04-19 08:01:56: Completed: 149  Processing: 1  Queued: 22
2019-04-19 08:02:31: Completed: 155  Processing: 1  Queued: 16
2019-04-19 08:03:05: Increased polling interval to 35 seconds
2019-04-19 08:03:05: Completed: 158  Processing: 1  Queued: 13
2019-04-19 08:03:40: Completed: 159  Processing: 1  Queued: 12
2019-04-19 08:04:15: Completed: 161  Processing: 1  Queued: 10
2019-04-19 08:04:50: Increased polling interval to 36 seconds
2019-04-19 08:04:50: Completed: 163  Processing: 0  Queued: 9
2019-04-19 08:05:26: Completed: 163  Processing: 0  Queued: 9
2019-04-19 08:06:03: Completed: 165  Processing: 1  Queued: 6
2019-04-19 08:06:39: Increased polling interval to 37 seconds
2019-04-19 08:06:39: Completed: 168  Processing: 1  Queued: 3
2019-04-19 08:07:16: Completed: 169  Processing: 1  Queued: 2
2019-04-19 08:07:53: Completed: 170  Processing: 1  Queued: 1
2019-04-19 08:08:30: Increased polling interval to 38 seconds
2019-04-19 08:08:30: Completed: 172  Processing: 0  Queued: 0
2019-04-19 08:08:30: Apex tests completed
2019-04-19 08:08:31: Class: ACCT_AccountMerge_TEST
2019-04-19 08:08:31: 	Pass: testMergeThreeHHAccountsManyAddr (2503s)
2019-04-19 08:08:31: 	Pass: testMergeThreeOrgAccountsManyAddr (809s)
2019-04-19 08:08:31: 	Pass: testMergeTwoHHAccounts (2724s)
2019-04-19 08:08:31: 	Pass: testMergeTwoOne2OneAccounts (1239s)
2019-04-19 08:08:31: 	Pass: testNamesAndOppsMergeHHToHH (2847s)
2019-04-19 08:08:31: 	Pass: testNamesAndOppsMergeHHToOrg (1904s)
2019-04-19 08:08:31: 	Pass: testNamesAndOppsMergeOne2OneToOne2One (1518s)
2019-04-19 08:08:31: 	Pass: testNamesAndOppsMergeOne2OneToOrg (1412s)
2019-04-19 08:08:31: 	Pass: testNamesAndOppsMergeOrgToHH (2337s)
2019-04-19 08:08:31: 	Pass: testNamesAndOppsMergeOrgToOne2One (1398s)
2019-04-19 08:08:31: Class: ACCT_CascadeDeleteLookups_TEST
2019-04-19 08:08:31: 	Pass: testAccountCascadeGrandchildren (2731s)
2019-04-19 08:08:31: 	Pass: testAccountMergeNoCascade (3402s)
2019-04-19 08:08:31: Class: ACCT_HHAccounts_TEST
2019-04-19 08:08:31: 	Pass: DeleteContactsFromHHAccounts (1252s)
2019-04-19 08:08:31: 	Pass: NewContactsEmptyHHAccounts (621s)
2019-04-19 08:08:31: 	Pass: NewContactsNoAccounts (579s)
2019-04-19 08:08:31: 	Pass: NewContactsNoAccountsWithHHObj (705s)
2019-04-19 08:08:31: 	Pass: NewContactsNonEmptyHHAccounts (694s)
2019-04-19 08:08:31: 	Pass: UndeleteContactsFromHHAccounts (971s)
2019-04-19 08:08:31: 	Pass: UpdateContactsMergeHHAccounts (1072s)
2019-04-19 08:08:31: 	Pass: UpdateContactsSplitHHAccounts (961s)
2019-04-19 08:08:31: 	Pass: UpdateOneToOneAndBucketContactsToHHAccounts (926s)
2019-04-19 08:08:31: 	Pass: addContactCheckAccountPrimaryContact (953s)
2019-04-19 08:08:31: 	Pass: addContactCheckNumberHHMembers (805s)
2019-04-19 08:08:31: 	Pass: changeContactOwners (1409s)
2019-04-19 08:08:31: 	Pass: changeContactsCheckOpps (1629s)
2019-04-19 08:08:31: 	Pass: newHHAccountWithRecordTypeOnly (153s)
2019-04-19 08:08:31: 	Pass: updateAccountToHHRecordType (236s)
2019-04-19 08:08:31: Class: ACCT_IndividualAccounts_TEST
2019-04-19 08:08:31: 	Pass: ACCT_IndividualAccounts_TEST (25s)
2019-04-19 08:08:31: 	Pass: attachToHHAccount (578s)
2019-04-19 08:08:31: 	Pass: attachToIndividualAccount (236s)
2019-04-19 08:08:31: 	Pass: changeFromOneToOneToHouseholdAccount (933s)
2019-04-19 08:08:31: 	Pass: contactAddedToExistingHHAccount (635s)
2019-04-19 08:08:31: 	Pass: contactAddedToExistingOneToOne (480s)
2019-04-19 08:08:31: 	Pass: contactInNormalOrgNameChangeHHAccount (443s)
2019-04-19 08:08:31: 	Pass: contactInNormalOrgNameChangeOneToOne (383s)
2019-04-19 08:08:31: 	Pass: contactUpdatedToExistingOneToOne (620s)
2019-04-19 08:08:31: 	Pass: contactUpdatedToExistingOneToOneHH (1038s)
2019-04-19 08:08:31: 	Pass: deleteContactNoOppHHAccount (814s)
2019-04-19 08:08:31: 	Pass: deleteContactNoOppOneToOne (429s)
2019-04-19 08:08:31: 	Pass: deleteContactNormalAccountHouseholdAcc (402s)
2019-04-19 08:08:31: 	Pass: deleteContactNormalAccountOneToOne (434s)
2019-04-19 08:08:31: 	Pass: deleteContactWithOppHHAccount (1206s)
2019-04-19 08:08:31: 	Pass: deleteContactWithOppOneToOne (524s)
2019-04-19 08:08:31: 	Pass: detachFromNormalAccountToBucket (495s)
2019-04-19 08:08:31: 	Pass: detachFromNormalAccountToBucketAccountProcessor (487s)
2019-04-19 08:08:31: 	Pass: detachFromNormalAccountToOneToOne (567s)
2019-04-19 08:08:31: 	Pass: detachFromNormalAccountToOneToOneHousehold (631s)
2019-04-19 08:08:31: 	Pass: detachHHAccount (568s)
2019-04-19 08:08:31: 	Pass: detachHHAccount2 (553s)
2019-04-19 08:08:31: 	Pass: detachIndividualAccount (319s)
2019-04-19 08:08:31: 	Pass: detachOneToOne (375s)
2019-04-19 08:08:31: 	Pass: editContactDuringDetachHHAccount (944s)
2019-04-19 08:08:31: 	Pass: editContactDuringDetachOneToOne (369s)
2019-04-19 08:08:31: 	Pass: ghIssue16a (395s)
2019-04-19 08:08:31: 	Pass: ghIssue16b (531s)
2019-04-19 08:08:31: 	Pass: insertBucketChangeToPrivate (331s)
2019-04-19 08:08:31: 	Pass: insertHHAccountChangeToPrivate (648s)
2019-04-19 08:08:31: 	Pass: insertHHAccountContactTitleForRename (634s)
2019-04-19 08:08:31: 	Pass: insertHHAccountTriggerOff (143s)
2019-04-19 08:08:31: 	Pass: insertOneToOneChangeToPrivate (399s)
2019-04-19 08:08:31: 	Pass: insertOneToOneTriggerOff (151s)
2019-04-19 08:08:31: 	Pass: insertPrivateBucket (199s)
2019-04-19 08:08:31: 	Pass: insertPrivateHHAccount (212s)
2019-04-19 08:08:31: 	Pass: insertPrivateOneToOne (193s)
2019-04-19 08:08:31: 	Pass: insertUpdateOneToOne (413s)
2019-04-19 08:08:31: 	Pass: insertUpdateOneToOneHouseholds (826s)
2019-04-19 08:08:31: 	Pass: regressionDuplicateIdInList (498s)
2019-04-19 08:08:31: 	Pass: shouldPopulateNewAccountCurrencyWithContactCurrency (413s)
2019-04-19 08:08:31: 	Pass: testContactDmlWhenHHNamingSettingsIsInvalidAndAutomaticHHNamingIsOff (416s)
2019-04-19 08:08:31: 	Pass: testContactSoqlReturnsQueryForSpecifiedContacts (1311s)
2019-04-19 08:08:31: 	Pass: test_insertAsOtherUser (614s)
2019-04-19 08:08:31: 	Pass: undeleteContactToExistingHH (1012s)
2019-04-19 08:08:31: 	Pass: undeleteHHContactNoOpp (595s)
2019-04-19 08:08:31: 	Pass: undeleteHHContactWithOpp (1446s)
2019-04-19 08:08:31: 	Pass: updateHHAccountRecType (567s)
2019-04-19 08:08:31: Class: ACCT_ViewOverride_TEST
2019-04-19 08:08:31: 	Pass: accountViewOverride (519s)
2019-04-19 08:08:31: 	Pass: noAccount (18s)
2019-04-19 08:08:31: Class: ADDR_Addresses_TEST
2019-04-19 08:08:31: 	Pass: ContactRepository_getContactsShouldReturnContactsWhenAccountHasContacts (1040s)
2019-04-19 08:08:31: 	Pass: ContactRepository_getContactsShouldReturnContactsWhenAccountHasNotBeenPassedToConstructor (752s)
2019-04-19 08:08:31: 	Pass: ContactRepository_getContactsShouldReturnEmptyListWhenAccountHasNoContacts (133s)
2019-04-19 08:08:31: 	Pass: addExistingContactToNewHouseholdShouldSyncPrimaryAddressTypeWithAddressType (1307s)
2019-04-19 08:08:31: 	Pass: addNewContactToHouseholdShouldSyncPrimaryAddressTypeWithAddressType (955s)
2019-04-19 08:08:31: 	Pass: addressShouldBePropagatedToAccountsAndContactsOnMultipleTriggerCalls (14251s)
2019-04-19 08:08:31: 	Pass: clearAddrOverride (1106s)
2019-04-19 08:08:31: 	Pass: clearAddrOverrideNewAddr (1778s)
2019-04-19 08:08:31: 	Pass: deleteDefaultAddr (1049s)
2019-04-19 08:08:31: 	Pass: deleteNonDefaultOverrideAddr (1133s)
2019-04-19 08:08:31: 	Pass: insertContactWithAddress (799s)
2019-04-19 08:08:31: 	Pass: insertContactWithAddressOverride (534s)
2019-04-19 08:08:31: 	Pass: insertContactWithAddressRecreateAccount (885s)
2019-04-19 08:08:31: 	Pass: insertNewDefaultAddr (993s)
2019-04-19 08:08:31: 	Pass: insertNewDefaultAddrAndReset (1249s)
2019-04-19 08:08:31: 	Pass: insertNewSeasonalAddr (946s)
2019-04-19 08:08:31: 	Pass: insertNewSeasonalAddrNotCurrent (929s)
2019-04-19 08:08:31: 	Pass: newAddrNoAccount (100s)
2019-04-19 08:08:31: 	Pass: newAddrNotHHAccount (183s)
2019-04-19 08:08:31: 	Pass: newDefaultAddr (764s)
2019-04-19 08:08:31: 	Pass: setConAddrNoOverride (855s)
2019-04-19 08:08:31: 	Pass: setConAddrOverride (1008s)
2019-04-19 08:08:31: 	Pass: testAddressOverrideCreatesNewAddressWhenStateCodeIsChanged (6s)
2019-04-19 08:08:31: 	Pass: testEmptyAddressCountryIsPopulatedFromCountryCode (6s)
2019-04-19 08:08:31: 	Pass: testEmptyAddressStateIsPopulatedFromStateCode (6s)
2019-04-19 08:08:31: 	Pass: testIsMatchingStateCode (6s)
2019-04-19 08:08:31: 	Pass: updateAccAddrExisting (1605s)
2019-04-19 08:08:31: 	Pass: updateAccAddrNew (1756s)
2019-04-19 08:08:31: 	Pass: updateAddrOverride (953s)
2019-04-19 08:08:31: 	Pass: updateConAddrExisting (1535s)
2019-04-19 08:08:31: 	Pass: updateConAddrExistingAddrType (1851s)
2019-04-19 08:08:31: 	Pass: updateConAddrExistingCaseOnly (2269s)
2019-04-19 08:08:31: 	Pass: updateConAddrMarkOverride (949s)
2019-04-19 08:08:31: 	Pass: updateConAddrNew (1907s)
2019-04-19 08:08:31: 	Pass: updateDefaultAddr (938s)
2019-04-19 08:08:31: 	Pass: updateNonDefaultAddr (754s)
2019-04-19 08:08:31: Class: ADDR_Addresses_TEST2
2019-04-19 08:08:31: 	Pass: clearConAddrExisting (1443s)
2019-04-19 08:08:31: 	Pass: deleteSeasonalAddr (1086s)
2019-04-19 08:08:31: 	Pass: insertConWithAddrToExistingHH (1197s)
2019-04-19 08:08:31: 	Pass: insertConWithDefaultAddrToExistingHH (925s)
2019-04-19 08:08:31: 	Pass: insertConWithNoAddrToExistingHH (1063s)
2019-04-19 08:08:31: 	Pass: insertContactWithMultilineStreetAddress (764s)
2019-04-19 08:08:31: 	Pass: insertNewDefaultMultilineStreetAddr (931s)
2019-04-19 08:08:31: 	Pass: insertPartialSeasonalAddr (733s)
2019-04-19 08:08:31: 	Pass: insertSeasonalAddrOverlapExisting (885s)
2019-04-19 08:08:31: 	Pass: insertSeasonalAddrWithOverlap (727s)
2019-04-19 08:08:31: 	Pass: newAddrForOrgAccounts (465s)
2019-04-19 08:08:31: 	Pass: newDupeAccountAddr (771s)
2019-04-19 08:08:31: 	Pass: newDupeAccountAddrNonDefault (1135s)
2019-04-19 08:08:31: 	Pass: newDupeContactAddr (759s)
2019-04-19 08:08:31: 	Pass: newDupeContactAddrNonDefault (1167s)
2019-04-19 08:08:31: 	Pass: newOrgAccounts (277s)
2019-04-19 08:08:31: 	Pass: scheduleSeasonalAddrReset (1291s)
2019-04-19 08:08:31: 	Pass: scheduleSeasonalAddrUpdate (1061s)
2019-04-19 08:08:31: 	Pass: setConAddrOverrideAndLookupOnNewContact (851s)
2019-04-19 08:08:31: 	Pass: testDisabledHHAccountAddr (438s)
2019-04-19 08:08:31: 	Pass: testSeasonalAddrOverlapLogic (9s)
2019-04-19 08:08:31: 	Pass: updateAccMultilineStreetAddr (1016s)
2019-04-19 08:08:31: 	Pass: updateAccMultilineStreetAddrNL (997s)
2019-04-19 08:08:31: 	Pass: updateConAddrWithExternalOverride (876s)
2019-04-19 08:08:31: 	Pass: updateConAddrWithOverride (925s)
2019-04-19 08:08:31: 	Pass: updateHHContactToNewHH (1343s)
2019-04-19 08:08:31: 	Pass: updateOrgAccounts (462s)
2019-04-19 08:08:31: 	Pass: updateOrgContactToHH (871s)
2019-04-19 08:08:31: 	Pass: updateSeasonalAddr (1502s)
2019-04-19 08:08:31: Class: ADDR_Cicero_TEST
2019-04-19 08:08:31: 	Pass: doesNotOverwriteAddr (30s)
2019-04-19 08:08:31: 	Pass: doesOverwriteAddr (19s)
2019-04-19 08:08:31: 	Pass: singleValidAddr (18s)
2019-04-19 08:08:31: Class: ADDR_CopyAddrHHObjBTN_TEST
2019-04-19 08:08:31: 	Pass: shouldCopyAddressFromContact (358s)
2019-04-19 08:08:31: 	Pass: shouldCopyAddressFromHousehold (253s)
2019-04-19 08:08:31: 	Pass: shouldDisplayConfirmationMessageWhenBtnClicked (51s)
2019-04-19 08:08:31: 	Pass: shouldErrorWhenBtnClickedWithoutContactReadPerms (35s)
2019-04-19 08:08:31: 	Pass: shouldErrorWhenBtnClickedWithoutContactUpdatePerms (36s)
2019-04-19 08:08:31: 	Pass: shouldErrorWhenBtnClickedWithoutHHReadPerms (36s)
2019-04-19 08:08:31: 	Pass: shouldErrorWhenBtnClickedWithoutHHUpdatePerms (37s)
2019-04-19 08:08:31: 	Pass: shouldErrorWhenCopyAddressFromAccount (97s)
2019-04-19 08:08:31: 	Pass: shouldReturnHomePageWhenUnsupportedRecordId (98s)
2019-04-19 08:08:31: 	Pass: shouldReturnPageReferenceWithRecordId (33s)
2019-04-19 08:08:31: Class: ADDR_GoogleGeoAPI_Validator_TEST
2019-04-19 08:08:31: 	Pass: testAmbiguousAddress (39s)
2019-04-19 08:08:31: 	Pass: testBadResponse (12s)
2019-04-19 08:08:31: 	Pass: testInterfaceStrings (8s)
2019-04-19 08:08:31: 	Pass: testInvalidRequestAddress (14s)
2019-04-19 08:08:31: 	Pass: testNullAuthToken (12s)
2019-04-19 08:08:31: 	Pass: testOverQueryLimitAddress (13s)
2019-04-19 08:08:31: 	Pass: testRequestDeniedAddress (14s)
2019-04-19 08:08:31: 	Pass: testSingleAddress (21s)
2019-04-19 08:08:31: 	Pass: testSingleAddressLongZipcode (19s)
2019-04-19 08:08:31: 	Pass: testSingleAddressSubPremise (24s)
2019-04-19 08:08:31: 	Pass: testUnknownErrorAddress (14s)
2019-04-19 08:08:31: 	Pass: testZeroResultsAddress (13s)
2019-04-19 08:08:31: Class: ADDR_MockGoogleGeoAPIResponse_TEST
2019-04-19 08:08:31: Class: ADDR_MockHttpRespGenerator_TEST
2019-04-19 08:08:31: Class: ADDR_Validation_Gateway_TEST
2019-04-19 08:08:31: 	Pass: testBadAuth (53s)
2019-04-19 08:08:31: 	Pass: testBadInput (22s)
2019-04-19 08:08:31: 	Pass: testMultiAddress (20s)
2019-04-19 08:08:31: 	Pass: testNoSubscription (23s)
2019-04-19 08:08:31: 	Pass: testOneAddress (24s)
2019-04-19 08:08:31: 	Pass: testServerError (23s)
2019-04-19 08:08:31: 	Pass: testZip (27s)
2019-04-19 08:08:31: Class: ADDR_Validator_Batch_TEST
2019-04-19 08:08:31: 	Pass: multipleValidAddresses (13259s)
2019-04-19 08:08:31: 	Pass: multipleValidAddressessZipcodes (1200s)
2019-04-19 08:08:31: 	Pass: multipleValidZipcodes (10s)
2019-04-19 08:08:31: 	Pass: oneValidAddress (925s)
2019-04-19 08:08:31: 	Pass: oneValidZipcode (887s)
2019-04-19 08:08:31: 	Pass: validAddressInvalidZipcode (11s)
2019-04-19 08:08:31: Class: ADDR_Validator_TEST
2019-04-19 08:08:31: 	Pass: dontValidatePreviouslyValidatedAddresses (1242s)
2019-04-19 08:08:31: 	Pass: hasAccessShouldReturnFalseWhenUserHasNoAcceessOnAddress (250s)
2019-04-19 08:08:31: 	Pass: hasAccessShouldReturnTrueWhenUserIsSystemAdmin (64s)
2019-04-19 08:08:31: 	Pass: healthCheckShouldDisplayMessageOnAddressVerificationError (27s)
2019-04-19 08:08:31: 	Pass: healthCheckShouldDisplayPermissionDeniedMessageWhenUserHasNoAccess (15s)
2019-04-19 08:08:31: 	Pass: healthCheckShouldDisplaySuccessWhenAddressIsValidated (20s)
2019-04-19 08:08:31: 	Pass: healthCheckShouldNotReturnAnyMessageWhenValidatorIsNotSmartyStreets (11s)
2019-04-19 08:08:31: 	Pass: shouldEncodeUnencodedSmartyStreetsToken (8s)
2019-04-19 08:08:31: 	Pass: shouldNotEncodeAlreadyEncodedSmartyStreetsToken (8s)
2019-04-19 08:08:31: 	Pass: shouldNotEncodeUnencodedTokenWhenValidatorIsNotSmartyStreets (7s)
2019-04-19 08:08:31: 	Pass: shouldNotRetrieveApiSettingsWhenUserHasNoAccess (19s)
2019-04-19 08:08:31: 	Pass: testAddressVerificationResponse400 (819s)
2019-04-19 08:08:31: 	Pass: testAddressVerificationResponse401 (766s)
2019-04-19 08:08:31: 	Pass: testAddressVerificationResponse402 (759s)
2019-04-19 08:08:31: 	Pass: testAddressVerificationResponse500 (753s)
2019-04-19 08:08:31: 	Pass: testBlankService (46s)
2019-04-19 08:08:31: 	Pass: testContactAddress (826s)
2019-04-19 08:08:31: 	Pass: testContactAmbiguousAddress (814s)
2019-04-19 08:08:31: 	Pass: testContactCityAndStateOnly (849s)
2019-04-19 08:08:31: 	Pass: testContactInvalidAddress (699s)
2019-04-19 08:08:31: 	Pass: testContactZipOnly (806s)
2019-04-19 08:08:31: 	Pass: testController (113s)
2019-04-19 08:08:31: 	Pass: testControllerMissingSetting (45s)
2019-04-19 08:08:31: 	Pass: verifyServiceShouldReturnNullWhenValidatorIsNotSmartyStreets (8s)
2019-04-19 08:08:31: 	Pass: verifyServiceShouldReturnPermissionDeniedMessageWhenUserHasNoAccess (13s)
2019-04-19 08:08:31: 	Pass: verifyServiceShouldReturnVerificationMessageWhenAddressIsValidated (18s)
2019-04-19 08:08:31: Class: ADV_Adapter_TEST
2019-04-19 08:08:31: 	Pass: configAccountForContactThrowException (40s)
2019-04-19 08:08:31: 	Pass: configAccountTDTMThrowException (22s)
2019-04-19 08:08:31: 	Pass: getDefaultTdtmConfigTokensThrowException (23s)
2019-04-19 08:08:31: 	Pass: moveOppsToContactAccountThrowException (22s)
2019-04-19 08:08:31: 	Pass: rollupAccountThrowException (22s)
2019-04-19 08:08:31: Class: AFFL_Affiliations_TEST
2019-04-19 08:08:31: 	Pass: contactWithMultipleAffiliations_v2 (696s)
2019-04-19 08:08:31: 	Pass: deletePrimaryAffl (1066s)
2019-04-19 08:08:31: 	Pass: newAccountNewAffl (957s)
2019-04-19 08:08:31: 	Pass: newContactOnIndividualAccount (276s)
2019-04-19 08:08:31: 	Pass: newContactOnOrgAccount (497s)
2019-04-19 08:08:31: 	Pass: newContactOnOrgAccountAutoOff (241s)
2019-04-19 08:08:31: 	Pass: newContactsWithPrimaryAffiliation (1261s)
2019-04-19 08:08:31: 	Pass: newContactsWithPrimaryAffiliationOnetoOne (744s)
2019-04-19 08:08:31: 	Pass: newPrimaryAffiliations (1149s)
2019-04-19 08:08:31: 	Pass: newPrimaryAffiliationsFromAffl (1155s)
2019-04-19 08:08:31: 	Pass: undeletePrimaryAfflNewAffl (987s)
2019-04-19 08:08:31: 	Pass: updateContactsWithPrimaryAffiliation (979s)
2019-04-19 08:08:31: 	Pass: updateContactsWithPrimaryAffiliationAndAccount (1085s)
2019-04-19 08:08:31: 	Pass: updateContactsWithPrimaryAffiliationClearPrimary (925s)
2019-04-19 08:08:31: 	Pass: updateContactsWithPrimaryAffiliationToDiffAccount (1136s)
2019-04-19 08:08:31: Class: ALLO_Allocations_TEST
2019-04-19 08:08:31: 	Pass: bulkOppInsert (3868s)
2019-04-19 08:08:31: 	Pass: campaignAllocations (913s)
2019-04-19 08:08:31: 	Pass: defaultAllocations (776s)
2019-04-19 08:08:31: 	Pass: oppAmountChange (1051s)
2019-04-19 08:08:31: 	Pass: pmtAmountChange (1171s)
2019-04-19 08:08:31: 	Pass: pmtsWithNegativeAmount (1035s)
2019-04-19 08:08:31: 	Pass: recurringDonationsValidation (1873s)
2019-04-19 08:08:31: 	Pass: testExcludedOpps (459s)
2019-04-19 08:08:31: 	Pass: testInactiveGAU (791s)
2019-04-19 08:08:31: 	Pass: testMakeDefaultAllocations (982s)
2019-04-19 08:08:31: 	Pass: testOppAllocationGauMatchesCampaignGau (673s)
2019-04-19 08:08:31: 	Pass: testOppNullAmount (748s)
2019-04-19 08:08:31: Class: ALLO_ManageAllocations_TEST
2019-04-19 08:08:31: 	Pass: testCam (594s)
2019-04-19 08:08:31: 	Pass: testGetCurrencySymbolCallsUtilCurrency (45s)
2019-04-19 08:08:31: 	Pass: testGetCurrencySymbolReturnsCachedSymbol (10s)
2019-04-19 08:08:31: 	Pass: testGetSeparators (9s)
2019-04-19 08:08:31: 	Pass: testOpp (666s)
2019-04-19 08:08:31: 	Pass: testOppNoAmount (318s)
2019-04-19 08:08:31: 	Pass: testPayment (688s)
2019-04-19 08:08:31: 	Pass: testRD (2534s)
2019-04-19 08:08:31: 	Pass: testResaveSucceedsWhenErrorIsFixed (380s)
2019-04-19 08:08:31: 	Pass: testSaveRollsBackAllDmlsOnError (330s)
2019-04-19 08:08:31: 	Pass: testSupportedObject (448s)
2019-04-19 08:08:31: 	Pass: testUnsupportedObject (167s)
2019-04-19 08:08:31: Class: ALLO_Multicurrency_TEST
2019-04-19 08:08:31: 	Pass: alloMultiCurrency (5s)
2019-04-19 08:08:31: 	Pass: rollupMultiCurrency (10s)
2019-04-19 08:08:31: 	Pass: testMakeDefaultAllocations (10s)
2019-04-19 08:08:31: Class: ALLO_Rollup_TEST
2019-04-19 08:08:31: 	Pass: rollupBTN (866s)
2019-04-19 08:08:31: 	Pass: rollupFiscalYear (632s)
2019-04-19 08:08:31: Class: BDE_BatchDataEntry_TEST
2019-04-19 08:08:31: 	Pass: testBatchDataEntry (288s)
2019-04-19 08:08:31: Class: BDE_BatchEntry_TEST
2019-04-19 08:08:31: 	Pass: testBatchDataEntryController (793s)
2019-04-19 08:08:31: 	Pass: testBatchWithSave (693s)
2019-04-19 08:08:31: 	Pass: testExistingBatchObjects (1136s)
2019-04-19 08:08:31: 	Pass: testNewObjectLoad (263s)
2019-04-19 08:08:31: 	Pass: testOtherConfig (753s)
2019-04-19 08:08:31: Class: BDI_BatchOverride_TEST
2019-04-19 08:08:31: 	Pass: saveClonedBatch (111s)
2019-04-19 08:08:31: 	Pass: saveExistingBatch (51s)
2019-04-19 08:08:31: 	Pass: saveNewBatch (42s)
2019-04-19 08:08:31: 	Pass: testBDIBatchUISaveValidation (27s)
2019-04-19 08:08:31: Class: BDI_DataImportAPI_TEST
2019-04-19 08:08:31: 	Pass: processErrorBatch (194s)
2019-04-19 08:08:31: 	Pass: processNoBatch (1048s)
2019-04-19 08:08:31: 	Pass: processRecordsDryRun (292s)
2019-04-19 08:08:31: 	Pass: processRecordsImport (737s)
2019-04-19 08:08:31: 	Pass: processSingleBatch (758s)
2019-04-19 08:08:31: 	Pass: processTwoBatches (1294s)
2019-04-19 08:08:31: Class: BDI_DataImportBatch_TEST
2019-04-19 08:08:31: 	Pass: scheduleMaxMultipleBatches (18681s)
2019-04-19 08:08:31: 	Pass: scheduleMultipleBatches (1443s)
2019-04-19 08:08:31: 	Pass: scheduleSingleBatch (829s)
2019-04-19 08:08:31: 	Pass: scheduleTooManyMultipleBatches (18295s)
2019-04-19 08:08:31: Class: BDI_DataImportCTRL_TEST
2019-04-19 08:08:31: 	Pass: TestBDIVisualforcePage (2335s)
2019-04-19 08:08:31: 	Pass: TestBDIVisualforcePageValidation (84s)
2019-04-19 08:08:31: 	Pass: testBDIDryRun (617s)
2019-04-19 08:08:31: 	Pass: testBatchStartImportButton (41s)
2019-04-19 08:08:31: 	Pass: testUserCanEditSettings (291s)
2019-04-19 08:08:31: 	Pass: testUserCannotEditSettings (174s)
2019-04-19 08:08:31: Class: BDI_DataImportDeleteBTN_TEST
2019-04-19 08:08:31: 	Pass: TestCloseWhenRetUrlIsBlank (27s)
2019-04-19 08:08:31: 	Pass: TestCloseWhenRetUrlIsNotProvided (9s)
2019-04-19 08:08:31: 	Pass: TestCloseWhenRetUrlIsProvided (8s)
2019-04-19 08:08:31: 	Pass: TestDeleteAllDataImportRecordsBtn (248s)
2019-04-19 08:08:31: 	Pass: TestDeleteAllDataImportRecordsBtnExceptionMessageDisplay (319s)
2019-04-19 08:08:31: 	Pass: TestDeleteImportedDataImportRecordsBtn (144s)
2019-04-19 08:08:31: 	Pass: TestDeleteImportedDataImportRecordsBtnExceptionMessageDisplay (245s)
2019-04-19 08:08:31: 	Pass: TestErrorMessageDisplayWhenPageActionParameterIsInvalid (68s)
2019-04-19 08:08:31: 	Pass: TestErrorMessageDisplayWhenPageActionParameterIsNotProvided (37s)
2019-04-19 08:08:31: 	Pass: throwsExceptionWhenUserCannotDelete (211s)
2019-04-19 08:08:31: Class: BDI_DataImportService_TEST
2019-04-19 08:08:31: 	Pass: rollupTriggersAreDeactivatedWhenRunRollupSettingsIsNotChecked (119s)
2019-04-19 08:08:31: 	Pass: rollupTriggersAreNotDeactivatedWhenRunRollupSettingsIsChecked (72s)
2019-04-19 08:08:31: 	Pass: testUniqueIdHandling (10s)
2019-04-19 08:08:31: Class: BDI_DataImport_TEST
2019-04-19 08:08:31: 	Pass: ManyDISameHomeAddresses (2118s)
2019-04-19 08:08:31: 	Pass: OneDIDuplicateNewContacts (1274s)
2019-04-19 08:08:31: 	Pass: OneDIExistingContacts1x1 (723s)
2019-04-19 08:08:31: 	Pass: OneDIExistingContactsCaseInsensitive (1255s)
2019-04-19 08:08:31: 	Pass: OneDIExistingContactsExistingHousehold (1193s)
2019-04-19 08:08:31: 	Pass: OneDITwoExistingContacts (1127s)
2019-04-19 08:08:31: 	Pass: OneDITwoNewAccounts (520s)
2019-04-19 08:08:31: 	Pass: OneDITwoNewContacts (912s)
2019-04-19 08:08:31: 	Pass: OneDITwoSameAccounts (466s)
2019-04-19 08:08:31: 	Pass: OneDIWithoutFirstName (895s)
2019-04-19 08:08:31: 	Pass: TwoDIAffiliations (1143s)
2019-04-19 08:08:31: 	Pass: TwoDIDuplicateNewContacts (677s)
2019-04-19 08:08:31: 	Pass: TwoDIDuplicateNewContactsDifferentOrder (918s)
2019-04-19 08:08:31: 	Pass: TwoDIExistingAccounts (469s)
2019-04-19 08:08:31: 	Pass: TwoDIExistingAccountsSalesforceId (1061s)
2019-04-19 08:08:31: 	Pass: TwoDIExistingHomeAddresses (1653s)
2019-04-19 08:08:31: 	Pass: TwoDIHomeAddresses (1068s)
2019-04-19 08:08:31: 	Pass: TwoDIHomeAddressesAddrMgmtOff (1015s)
2019-04-19 08:08:31: 	Pass: TwoDIMixedAddresses (1503s)
2019-04-19 08:08:31: 	Pass: TwoDIMixedAddressesAddrMgmtOff (1073s)
2019-04-19 08:08:31: 	Pass: TwoDINewContactsExistingsHousehold (1107s)
2019-04-19 08:08:31: 	Pass: TwoDISameAccounts (556s)
2019-04-19 08:08:31: 	Pass: TwoDITwoNewContacts (750s)
2019-04-19 08:08:31: 	Pass: TwoDITwoNewContactsHouseholdFields (1308s)
2019-04-19 08:08:31: 	Pass: TwoDIWithAccountDonations (805s)
2019-04-19 08:08:31: 	Pass: TwoDIWithCampaignMembers (934s)
2019-04-19 08:08:31: 	Pass: TwoDIWithDonationErrors (735s)
2019-04-19 08:08:31: 	Pass: TwoDIWithDonations (1235s)
2019-04-19 08:08:31: 	Pass: TwoDIWithDonationsAndCampaignIds (1106s)
2019-04-19 08:08:31: 	Pass: TwoDIWithDonationsAndCampaignIdsAfterDryRun (1430s)
2019-04-19 08:08:31: 	Pass: TwoDIWithDonationsAndCampaignIdsInDryRun (448s)
2019-04-19 08:08:31: 	Pass: TwoDIWithDonationsAndCampaigns (1165s)
2019-04-19 08:08:31: 	Pass: TwoDIWithDonationsAndDuplicateCampaignNameInDryRun (425s)
2019-04-19 08:08:31: 	Pass: TwoDIWithDonationsAndDuplicateCampaignNames (1068s)
2019-04-19 08:08:31: Class: BDI_DataImport_TEST2
2019-04-19 08:08:31: 	Pass: ManyDIDuplicateEmailExistingContacts (1894s)
2019-04-19 08:08:31: 	Pass: ManyDIDuplicateEmailNewContacts (868s)
2019-04-19 08:08:31: 	Pass: ManyDIDuplicateNewContactManyFields (799s)
2019-04-19 08:08:31: 	Pass: ManyDIDuplicatePhoneNewContacts (800s)
2019-04-19 08:08:31: 	Pass: ManyDIMultiContactMatchRules1 (1183s)
2019-04-19 08:08:31: 	Pass: ManyDIMultiContactMatchRules2 (1095s)
2019-04-19 08:08:31: 	Pass: ManyDIMultiContactMatchRules3 (1159s)
2019-04-19 08:08:31: 	Pass: ManyDIMultiContactMatchRules4 (1131s)
2019-04-19 08:08:31: 	Pass: ManyDIMultiContactMatchRules5 (1091s)
2019-04-19 08:08:31: 	Pass: ManyDIMultiContactMatchRules6 (1044s)
2019-04-19 08:08:31: 	Pass: ManyDIMultiContactMatchRules7 (1111s)
2019-04-19 08:08:31: 	Pass: ManyDIMultiContactMatchRules8 (1047s)
2019-04-19 08:08:31: 	Pass: ManyDIMultiContactMatchRules9 (1101s)
2019-04-19 08:08:31: 	Pass: ManyDIOverlappingEmailExistingContacts (1012s)
2019-04-19 08:08:31: 	Pass: ManyDIOverlappingPhoneExistingContacts (993s)
2019-04-19 08:08:31: 	Pass: ManyDISalesforceIdMatchingExistingAndNewContacts (1218s)
2019-04-19 08:08:31: 	Pass: ManyDISalesforceIdMatchingExistingContacts (969s)
2019-04-19 08:08:31: 	Pass: ManyDISomeInvalidContactData (1324s)
2019-04-19 08:08:31: 	Pass: ManyDITestAccountDataErrorHandling (842s)
2019-04-19 08:08:31: 	Pass: ManyDITestAddressDataErrorHandling (1332s)
2019-04-19 08:08:31: 	Pass: ManyDITestCampaignDataErrorHandling (993s)
2019-04-19 08:08:31: 	Pass: ManyDITestContactDataErrorHandling (1466s)
2019-04-19 08:08:31: 	Pass: ManyDITestDonationDataErrorHandling (1005s)
2019-04-19 08:08:31: 	Pass: ManyDIUniqueIdMatchingExistingAccounts (559s)
2019-04-19 08:08:31: 	Pass: ManyDIUniqueIdMatchingExistingContacts (1039s)
2019-04-19 08:08:31: 	Pass: ManyDIUniqueIdMatchingNewAndExistingAccounts (565s)
2019-04-19 08:08:31: 	Pass: ManyDIUniqueIdMatchingNewAndExistingContacts (1428s)
2019-04-19 08:08:31: 	Pass: ManyDIUniqueIdNewAccounts (507s)
2019-04-19 08:08:31: 	Pass: ManyDIUniqueIdNewContacts (716s)
2019-04-19 08:08:31: 	Pass: ManyDIUniqueIdNotMatchingExistingContacts (1083s)
2019-04-19 08:08:31: 	Pass: OneDISalesforceIdMatchingExistingAndNewContact (961s)
2019-04-19 08:08:31: 	Pass: SingleDISalesforceIdMatchingExistingHousehold (1119s)
2019-04-19 08:08:31: 	Pass: TwoDIExistingC2PartialMatch (908s)
2019-04-19 08:08:31: 	Pass: TwoDINewC2PartialMatch (848s)
2019-04-19 08:08:31: 	Pass: testFieldLevelSecurity (427s)
2019-04-19 08:08:31: 	Pass: testInvalidAccountModel (36s)
2019-04-19 08:08:31: 	Pass: testInvalidAddressHandling (1410s)
2019-04-19 08:08:31: 	Pass: testOneToOneAccountModelWithADV (11s)
2019-04-19 08:08:31: 	Pass: testPreferredEmailAutoSetting (819s)
2019-04-19 08:08:31: 	Pass: testPreferredPhoneAutoSetting (917s)
2019-04-19 08:08:31: Class: BDI_Donations_TEST
2019-04-19 08:08:31: 	Pass: TwoDIWithExistingDonations (2129s)
2019-04-19 08:08:31: 	Pass: TwoDIWithExistingDonationsNoExtraPaymentUpdates (1744s)
2019-04-19 08:08:31: 	Pass: TwoDIWithExistingDonationsOneDupe (2188s)
2019-04-19 08:08:31: 	Pass: TwoDIWithExistingDonationsPreservePaymentDate (2007s)
2019-04-19 08:08:31: 	Pass: TwoDIWithExistingDonationsSpecified (1708s)
2019-04-19 08:08:31: 	Pass: TwoDIWithExistingDonationsSpecified_mapAndUpdateCheckbox (1736s)
2019-04-19 08:08:31: 	Pass: TwoDIWithExistingDonationsSpecified_mapCheckboxNoUpdate (1734s)
2019-04-19 08:08:31: 	Pass: TwoDIWithExistingPaymentsSpecified (1800s)
2019-04-19 08:08:31: 	Pass: TwoDIWithUserSelectedExistingDonations (2141s)
2019-04-19 08:08:31: 	Pass: TwoDIWithUserSelectedExistingDonationsApplyNewPayment (2074s)
2019-04-19 08:08:31: 	Pass: TwoDIWithUserSelectedNewOpportunities (1834s)
2019-04-19 08:08:31: 	Pass: currencyShouldCopyToOpportunity (14s)
2019-04-19 08:08:31: 	Pass: dataImportWithExistingDonationInNonDefaultCurrency (13s)
2019-04-19 08:08:31: 	Pass: dataImportWithNonMatchingCurrencyDonation (13s)
2019-04-19 08:08:31: 	Pass: donationMatchRules1 (2325s)
2019-04-19 08:08:31: 	Pass: donationMatchRules10 (1655s)
2019-04-19 08:08:31: 	Pass: donationMatchRules10b (1599s)
2019-04-19 08:08:31: 	Pass: donationMatchRules11 (1676s)
2019-04-19 08:08:31: 	Pass: donationMatchRules11b (1726s)
2019-04-19 08:08:31: 	Pass: donationMatchRules12 (1611s)
2019-04-19 08:08:31: 	Pass: donationMatchRules13 (1700s)
2019-04-19 08:08:31: 	Pass: donationMatchRules14 (1739s)
2019-04-19 08:08:31: 	Pass: donationMatchRules14b (1539s)
2019-04-19 08:08:31: 	Pass: donationMatchRules14c (1728s)
2019-04-19 08:08:31: 	Pass: donationMatchRules15 (1548s)
2019-04-19 08:08:31: 	Pass: donationMatchRules16 (2230s)
2019-04-19 08:08:31: 	Pass: donationMatchRules17 (1911s)
2019-04-19 08:08:31: 	Pass: donationMatchRules18a (1940s)
2019-04-19 08:08:31: 	Pass: donationMatchRules18b (1932s)
2019-04-19 08:08:31: 	Pass: donationMatchRules18c (1961s)
2019-04-19 08:08:31: 	Pass: donationMatchRules18d (1698s)
2019-04-19 08:08:31: 	Pass: donationMatchRules19 (1911s)
2019-04-19 08:08:31: 	Pass: donationMatchRules1b (1908s)
2019-04-19 08:08:31: 	Pass: donationMatchRules1c (1730s)
2019-04-19 08:08:31: 	Pass: donationMatchRules1d (1982s)
2019-04-19 08:08:31: 	Pass: donationMatchRules2 (2136s)
2019-04-19 08:08:31: 	Pass: donationMatchRules3 (10s)
2019-04-19 08:08:31: 	Pass: donationMatchRules4 (1720s)
2019-04-19 08:08:31: 	Pass: donationMatchRules4b (1799s)
2019-04-19 08:08:31: 	Pass: donationMatchRules5 (1698s)
2019-04-19 08:08:31: 	Pass: donationMatchRules5b (1765s)
2019-04-19 08:08:31: 	Pass: donationMatchRules6 (1729s)
2019-04-19 08:08:31: 	Pass: donationMatchRules7 (1625s)
2019-04-19 08:08:31: 	Pass: donationMatchRules7b (1803s)
2019-04-19 08:08:31: 	Pass: donationMatchRules8 (1567s)
2019-04-19 08:08:31: 	Pass: donationMatchRules9 (1675s)
2019-04-19 08:08:31: 	Pass: donationMatchRules9b (2260s)
2019-04-19 08:08:31: 	Pass: matchDonationIdToPaidClosedOppBestMatchOrCreate (1903s)
2019-04-19 08:08:31: 	Pass: matchDonationIdToPaidClosedOppDoNotMatch (1807s)
2019-04-19 08:08:31: 	Pass: matchDonationIdToPaidClosedOppExactMatchOrCreate (1753s)
2019-04-19 08:08:31: 	Pass: matchDonationIdToPaidClosedOppRequireBestMatch (1772s)
2019-04-19 08:08:31: 	Pass: matchDonationIdToPaidClosedOppRequireExactMatch (1788s)
2019-04-19 08:08:31: 	Pass: matchDonationIdToPaidClosedOppRequireNoMatch (1719s)
2019-04-19 08:08:31: 	Pass: matchPaymentIdToPaidClosedOppBestMatchOrCreate (2059s)
2019-04-19 08:08:31: 	Pass: matchPaymentIdToPaidClosedOppDoNotMatch (1951s)
2019-04-19 08:08:31: 	Pass: matchPaymentIdToPaidClosedOppExactMatchOrCreate (1966s)
2019-04-19 08:08:31: 	Pass: matchPaymentIdToPaidClosedOppRequireBestMatch (1946s)
2019-04-19 08:08:31: 	Pass: matchPaymentIdToPaidClosedOppRequireExactMatch (1937s)
2019-04-19 08:08:31: 	Pass: matchPaymentIdToPaidClosedOppRequireNoMatch (1946s)
2019-04-19 08:08:31: 	Pass: rollupShouldNotBeCalculatedWhenRollupSettingsIsNotChecked (1161s)
2019-04-19 08:08:31: Class: BDI_DryRun_TEST
2019-04-19 08:08:31: 	Pass: TwoDIWithDonationsAndCampaignIdsInDryRun (794s)
2019-04-19 08:08:31: 	Pass: TwoDIWithDonationsAndDuplicateCampaignNameInDryRun (423s)
2019-04-19 08:08:31: 	Pass: manyDIContainingErrors (444s)
2019-04-19 08:08:31: 	Pass: manyDIExistingA1A2Accounts (549s)
2019-04-19 08:08:31: 	Pass: manyDIExistingC1ContactExistingBestMatchedDonations (1299s)
2019-04-19 08:08:31: 	Pass: manyDIExistingC1ContactExistingMatchedByIdDonations (1044s)
2019-04-19 08:08:31: 	Pass: manyDIExistingC1ContactExistingMatchedByIdPayments (1151s)
2019-04-19 08:08:31: 	Pass: manyDIExistingC1ContactExistingMatchedDonations (1110s)
2019-04-19 08:08:31: 	Pass: manyDIExistingC1ContactNewDonations (842s)
2019-04-19 08:08:31: 	Pass: manyDIExistingC1ContactNewDonationsInvalidRecordtype (853s)
2019-04-19 08:08:31: 	Pass: manyDIExistingC1andC2Contacts (933s)
2019-04-19 08:08:31: 	Pass: manyDIExistingHomeAddresses (1104s)
2019-04-19 08:08:31: 	Pass: manyDINewC1ContactNewDonations (405s)
2019-04-19 08:08:31: 	Pass: manyDINewC1andC2Contacts (441s)
2019-04-19 08:08:31: 	Pass: manyDISameBatch (515s)
2019-04-19 08:08:31: 	Pass: manyDISameNewA1A2Accounts (445s)
2019-04-19 08:08:31: 	Pass: manyDISameNewC1Contact (452s)
2019-04-19 08:08:31: 	Pass: manyDISameNewC1andC2Contacts (677s)
2019-04-19 08:08:31: 	Pass: manyDIUpdatedHomeAddresses (1113s)
2019-04-19 08:08:31: Class: BDI_PerfLogger_TEST
2019-04-19 08:08:31: 	Pass: testPerfLoggerMultipleCallsSameLabel (2103s)
2019-04-19 08:08:31: 	Pass: testPerfLoggerSaving (2035s)
2019-04-19 08:08:31: 	Pass: testPerfLoggerTiming (2036s)
2019-04-19 08:08:31: Class: BDI_PostProcess_TEST
2019-04-19 08:08:31: 	Pass: testRelCreatedForDIsWithC1AndC2 (1581s)
2019-04-19 08:08:31: Class: BDI_SettingsUI_TEST
2019-04-19 08:08:31: 	Pass: testBDISettingsUI (279s)
2019-04-19 08:08:31: Class: BGE_BatchGiftEntryTab_CTRL_TEST
2019-04-19 08:08:31: 	Pass: testGetSortedData (231s)
2019-04-19 08:08:31: 	Pass: testGetTableModel (96s)
2019-04-19 08:08:31: Class: BGE_BatchGiftEntry_UTIL_TEST
2019-04-19 08:08:31: 	Pass: testCheckFieldPermissionsNeededForBatch (93s)
2019-04-19 08:08:31: 	Pass: testHandleMissingPermissions (36s)
2019-04-19 08:08:31: 	Pass: testTruncateList (10s)
2019-04-19 08:08:31: Class: BGE_ConfigurationWizard_CTRL_TEST
2019-04-19 08:08:31: 	Pass: testGetExistingRecordDetails (1023s)
2019-04-19 08:08:31: 	Pass: testGetNewBatchDetails (111s)
2019-04-19 08:08:31: 	Pass: testSaveExistingBatch (46s)
2019-04-19 08:08:31: 	Pass: testSaveNewBatchWithDefaults (71s)
2019-04-19 08:08:31: Class: BGE_DataImportBatchEntry_CTRL_TEST
2019-04-19 08:08:31: 	Pass: testDeleteDataImportRow (1229s)
2019-04-19 08:08:31: 	Pass: testGetEmptyOpenDonations (450s)
2019-04-19 08:08:31: 	Pass: testGetExistingDataImport (499s)
2019-04-19 08:08:31: 	Pass: testGetNewDataImport (6s)
2019-04-19 08:08:31: 	Pass: testGetOpenDonationsWithNoOpps (42078s)
2019-04-19 08:08:31: 	Pass: testGetOpenDonationsWithNoOppsOrPayments (1250s)
2019-04-19 08:08:31: 	Pass: testGetOpenDonationsWithNoPayments (598s)
2019-04-19 08:08:31: 	Pass: testGetOpenDonationsWithOppsAndPayments (733s)
2019-04-19 08:08:31: 	Pass: testUpdateDataImports (619s)
2019-04-19 08:08:31: Class: CAM_CascadeDeleteLookups_TEST
2019-04-19 08:08:31: 	Pass: testCampaignCascadeDelete (954s)
2019-04-19 08:08:31: Class: CAO_Constants_API_TEST
2019-04-19 08:08:31: 	Pass: test_cao_api (25s)
2019-04-19 08:08:31: Class: CDL_CascadeDeleteLookups_TEST
2019-04-19 08:08:31: Class: CMT_FilterRuleEvaluation_TEST
2019-04-19 08:08:31: 	Pass: test_evaluateFilterRules (3685s)
2019-04-19 08:08:31: Class: CMT_FilterRule_TEST
2019-04-19 08:08:31: 	Pass: constructorShouldHandleDateTimesStoredAsDates (127s)
2019-04-19 08:08:31: 	Pass: constructorShouldHandleNullDates (40s)
2019-04-19 08:08:31: 	Pass: constructorShouldHandleNullRecordTypeIds (42s)
2019-04-19 08:08:31: 	Pass: constructorShouldHandleRecordTypeDeveloperName (42s)
2019-04-19 08:08:31: 	Pass: isIncludedShouldHandleNullIds (61s)
2019-04-19 08:08:31: 	Pass: test_DateConstantComparison (40s)
2019-04-19 08:08:31: 	Pass: test_FilterRule_Selectors (118s)
2019-04-19 08:08:31: 	Pass: test_OperationMethods (68s)
2019-04-19 08:08:31: Class: CMT_MetadataAPI_TEST
2019-04-19 08:08:31: 	Fail: test_cmt_api (109s)
2019-04-19 08:08:31: 	Message: System.NullPointerException: Attempt to de-reference a null object
2019-04-19 08:08:31: 	StackTrace: Class.npsp.CMT_MetadataAPI.MetadataCallBack.handleResult: line 179, column 1
Class.npsp.CMT_MetadataAPI_TEST.test_cmt_api: line 59, column 1
2019-04-19 08:08:31: Class: CMT_UnitTestData_TEST
2019-04-19 08:08:31: Class: CONV_Account_Conversion_BATCH_TEST
2019-04-19 08:08:31: 	Pass: test2ContactAddresses (1674s)
2019-04-19 08:08:31: 	Pass: testAccountConversion1to1 (23229s)
2019-04-19 08:08:31: 	Pass: testAccountConversionBucket (1205s)
2019-04-19 08:08:31: 	Pass: testContactDisableAddresses (1078s)
2019-04-19 08:08:31: 	Pass: testSettingPrimaryAffiliation (1002s)
2019-04-19 08:08:31: 	Pass: testSingleContactAddress (870s)
2019-04-19 08:08:31: Class: CONV_Account_Conversion_CTRL_TEST
2019-04-19 08:08:31: 	Pass: testConversionCTRLErrorState (1717s)
2019-04-19 08:08:31: 	Pass: testConversionCtrl (1298s)
2019-04-19 08:08:31: Class: CON_CascadeDeleteLookups_TEST
2019-04-19 08:08:31: 	Pass: testContactCascadeDelete (1545s)
2019-04-19 08:08:31: 	Pass: testContactMergeNoCascade (1939s)
2019-04-19 08:08:31: Class: CON_ChangeAccount_TEST
2019-04-19 08:08:31: 	Pass: testAddressOverride (1594s)
2019-04-19 08:08:31: 	Pass: testGetsDefaultAddressHHToHH (1771s)
2019-04-19 08:08:31: 	Pass: testGetsDefaultAddressHHToOrg (1266s)
2019-04-19 08:08:31: 	Pass: testGetsDefaultAddressOne2OneToOne2One (666s)
2019-04-19 08:08:31: 	Pass: testGetsDefaultAddressOne2OneToOrg (634s)
2019-04-19 08:08:31: 	Pass: testGetsDefaultAddressOrgToHH (1337s)
2019-04-19 08:08:31: 	Pass: testGetsDefaultAddressOrgToOne2One (695s)
2019-04-19 08:08:31: 	Pass: testNamesAndOppsUpdatedHHToHH (3192s)
2019-04-19 08:08:31: 	Pass: testNamesAndOppsUpdatedHHToOrg (1654s)
2019-04-19 08:08:31: 	Pass: testNamesAndOppsUpdatedOne2OneToOne2One (1157s)
2019-04-19 08:08:31: 	Pass: testNamesAndOppsUpdatedOne2OneToOrg (1281s)
2019-04-19 08:08:31: 	Pass: testNamesAndOppsUpdatedOrgToHH (1628s)
2019-04-19 08:08:31: 	Pass: testNamesAndOppsUpdatedOrgToOne2One (1111s)
2019-04-19 08:08:31: Class: CON_ContactMergeTDTM_TEST
2019-04-19 08:08:31: 	Pass: mergeContactsDifferentHHAccount (1931s)
2019-04-19 08:08:31: 	Pass: mergeContactsDifferentHHAccountAddressOverride (1387s)
2019-04-19 08:08:31: 	Pass: mergeContactsDifferentHHAccountManyAffl (1868s)
2019-04-19 08:08:31: 	Pass: mergeContactsSameHHAccount (1476s)
2019-04-19 08:08:31: 	Pass: shouldReturnAccountIdByMasterContactIdWhenAccountsAreIndividualType (11s)
2019-04-19 08:08:31: 	Pass: shouldReturnAccountIdByMasterContactIdWhenContactsAccountsAreIndividualType (10s)
2019-04-19 08:08:31: 	Pass: shouldReturnAccountIdsWhenAccountsAreHouseholds (11s)
2019-04-19 08:08:31: 	Pass: shouldReturnAccountIdsWhenContactsAccountsAreHouseholds (10s)
2019-04-19 08:08:31: 	Pass: shouldReturnEmptyListWhenAccountsAreNotHouseholds (9s)
2019-04-19 08:08:31: 	Pass: shouldReturnEmptyListWhenContactsAccountsAreNotHouseholds (10s)
2019-04-19 08:08:31: 	Pass: shouldReturnEmptyMapWhenAccountsAreIndividualType (9s)
2019-04-19 08:08:31: 	Pass: shouldReturnEmptyMapWhenContactsAccountsAreIndividualType (11s)
2019-04-19 08:08:31: 	Pass: shouldSetMergeKeyIds (10s)
2019-04-19 08:08:31: Class: CON_ContactMergeTDTM_TEST2
2019-04-19 08:08:31: 	Pass: contactMergeShouldRecalculateRollup (8459s)
2019-04-19 08:08:31: 	Pass: mergeContactsDifferentHHAccountManyRel (2335s)
2019-04-19 08:08:31: 	Pass: testNamesAndOppsMergeHHToHH (3911s)
2019-04-19 08:08:31: 	Pass: testNamesAndOppsMergeHHToOrg (2759s)
2019-04-19 08:08:31: 	Pass: testNamesAndOppsMergeOne2OneToOne2One (5125s)
2019-04-19 08:08:31: 	Pass: testNamesAndOppsMergeOne2OneToOrg (2102s)
2019-04-19 08:08:31: 	Pass: testNamesAndOppsMergeOrgToHH (2427s)
2019-04-19 08:08:31: 	Pass: testNamesAndOppsMergeOrgToOne2One (1630s)
2019-04-19 08:08:31: 	Pass: testNamesAndOppsMergeOrgToOrg (1385s)
2019-04-19 08:08:31: Class: CON_ContactMerge_TEST
2019-04-19 08:08:31: 	Pass: exerciseUIHHAccount (1077s)
2019-04-19 08:08:31: 	Pass: exerciseUIOne2One (500s)
2019-04-19 08:08:31: 	Pass: failMergeWithDeletedRecordSelectedHHAccount (824s)
2019-04-19 08:08:31: 	Pass: failMergeWithDeletedRecordSelectedOne2One (579s)
2019-04-19 08:08:31: 	Pass: failNextStepWithDeletedRecordSelectedHHAccount (707s)
2019-04-19 08:08:31: 	Pass: failNextStepWithDeletedRecordSelectedOne2One (515s)
2019-04-19 08:08:31: 	Pass: merge1Org1OneToOneHHAccount (1434s)
2019-04-19 08:08:31: 	Pass: merge1Org1OneToOneOne2One (1211s)
2019-04-19 08:08:31: 	Pass: merge2IndividualsHHAccount (926s)
2019-04-19 08:08:31: 	Pass: merge2IndividualsOne2One (934s)
2019-04-19 08:08:31: 	Pass: merge2OneToOneHHAccount (1566s)
2019-04-19 08:08:31: 	Pass: merge2OneToOneOne2One (1484s)
2019-04-19 08:08:31: 	Pass: merge2OneToOneOppsHHAccount (2354s)
2019-04-19 08:08:31: 	Pass: merge2OneToOneOppsOne2One (1924s)
2019-04-19 08:08:31: 	Pass: merge2OrganizationsHHAccount (1040s)
2019-04-19 08:08:31: 	Pass: merge2OrganizationsOne2One (990s)
2019-04-19 08:08:31: 	Pass: merge2PrivateContactsHHAccount (749s)
2019-04-19 08:08:31: 	Pass: merge2PrivateContactsOne2One (743s)
2019-04-19 08:08:31: 	Pass: tooFewContactsSelectedHHAccount (422s)
2019-04-19 08:08:31: 	Pass: tooFewContactsSelectedOne2One (269s)
2019-04-19 08:08:31: 	Pass: tooManyContactsSelectedHHAccount (569s)
2019-04-19 08:08:31: 	Pass: tooManyContactsSelectedOne2One (358s)
2019-04-19 08:08:31: Class: CON_ContactMerge_TEST2
2019-04-19 08:08:31: 	Pass: ghIssue6HHAccount (2082s)
2019-04-19 08:08:31: 	Pass: ghIssue6One2One (1391s)
2019-04-19 08:08:31: 	Pass: householdDifferentFromMaster (1996s)
2019-04-19 08:08:31: 	Pass: merge2OneToOneInSameAccountHHAccount (1412s)
2019-04-19 08:08:31: 	Pass: merge2OneToOneInSameAccountOne2One (1584s)
2019-04-19 08:08:31: 	Pass: merge3OneToOneHHAccount (3530s)
2019-04-19 08:08:31: 	Pass: merge3OneToOneOne2One (1964s)
2019-04-19 08:08:31: 	Pass: personAccountErrorDetection (36s)
2019-04-19 08:08:31: 	Pass: testBadIdsPassed (342s)
2019-04-19 08:08:31: 	Pass: testGoodIdsPassed (448s)
2019-04-19 08:08:31: 	Pass: testNamesAndOppsMergeBucketToHH (2978s)
2019-04-19 08:08:31: 	Pass: testNamesAndOppsMergeBucketToOne2One (2314s)
2019-04-19 08:08:31: 	Pass: testNamesAndOppsMergeHHToBucket (2757s)
2019-04-19 08:08:31: 	Pass: testNamesAndOppsMergeHHToHH (3830s)
2019-04-19 08:08:31: 	Pass: testNamesAndOppsMergeHHToOne2One (2768s)
2019-04-19 08:08:31: 	Pass: testNamesAndOppsMergeHHToOrg (2299s)
2019-04-19 08:08:31: 	Pass: testNamesAndOppsMergeOne2OneToBucket (1778s)
2019-04-19 08:08:31: 	Pass: testNamesAndOppsMergeOne2OneToHH (3008s)
2019-04-19 08:08:31: 	Pass: testNamesAndOppsMergeOne2OneToOne2One (2171s)
2019-04-19 08:08:31: 	Pass: testNamesAndOppsMergeOne2OneToOrg (1814s)
2019-04-19 08:08:31: 	Pass: testNamesAndOppsMergeOrgToHH (2289s)
2019-04-19 08:08:31: 	Pass: testNamesAndOppsMergeOrgToOne2One (1924s)
2019-04-19 08:08:31: 	Pass: testNamesAndOppsMergeOrgToOrg (1983s)
2019-04-19 08:08:31: 	Pass: testSearchSpecPassed (329s)
2019-04-19 08:08:31: 	Pass: testStandardSetSelected (424s)
2019-04-19 08:08:31: Class: CON_DeleteContactOverride_TEST
2019-04-19 08:08:31: 	Pass: deleteAloneInHousehold (925s)
2019-04-19 08:08:31: 	Pass: deleteOneToOne (446s)
2019-04-19 08:08:31: 	Pass: deleteWithOtherMembers (997s)
2019-04-19 08:08:31: 	Pass: testAccountDeleteExceptionWithOverride (2501s)
2019-04-19 08:08:31: 	Pass: testContactDeleteExceptionWithOverride (1885s)
2019-04-19 08:08:31: 	Pass: testContactDeleteWithOverride (1225s)
2019-04-19 08:08:31: 	Pass: testDeleteContactAndLeaveEmptyAccount (573s)
2019-04-19 08:08:31: 	Pass: testNavigationParametersAreSetInConstructor (402s)
2019-04-19 08:08:31: 	Pass: testOnCancel (397s)
2019-04-19 08:08:31: 	Pass: testRetUrlForClassicAndLex (444s)
2019-04-19 08:08:31: 	Pass: testRetUrlIsContactHomeIfNotProvided (407s)
2019-04-19 08:08:31: Class: CON_DoNotContact_TEST
2019-04-19 08:08:31: 	Pass: testDeceasedAlone (835s)
2019-04-19 08:08:31: 	Pass: testDeceasedInHousehold (821s)
2019-04-19 08:08:31: 	Pass: testDoNotContact (522s)
2019-04-19 08:08:31: Class: CRLP_ApiService_TEST
2019-04-19 08:08:31: 	Pass: shouldReturnEmptyListWhenCRLPNotEnabled (77s)
2019-04-19 08:08:31: 	Pass: shouldReturnRollupDefinitionsWhenParameterIsValid (307s)
2019-04-19 08:08:31: 	Pass: shouldThrowExceptionWhenParameterIsInvalid (22s)
2019-04-19 08:08:31: Class: CRLP_Batch_Base_TEST
2019-04-19 08:08:31: 	Pass: accountHardCreditRollupChunkModeFirstJobQueryContainsOrderByLimit (428s)
2019-04-19 08:08:31: 	Pass: accountHardCreditRollupChunkModeQueryContainsOrderByLimitId (879s)
2019-04-19 08:08:31: 	Pass: accountHardCreditRollupGeneratesIncrementalModeJoinQuery (152s)
2019-04-19 08:08:31: 	Pass: accountHardCreditRollupGeneratesLastNDaysJoinQuery (149s)
2019-04-19 08:08:31: 	Pass: accountHardCreditRollupGeneratesLastNDaysJoinQueryWithCustomSettingFalse (155s)
2019-04-19 08:08:31: 	Pass: accountHardCreditRollupGeneratesLastNYearsJoinQuery (161s)
2019-04-19 08:08:31: 	Pass: accountHardCreditRollupWithUserDefinedJoinGeneratesProperJoinQuery (149s)
2019-04-19 08:08:31: 	Pass: chunkModeRollupHasAdditionalRecordsToProcess (1080s)
2019-04-19 08:08:31: 	Pass: contactHardCreditRollupChunkModeFirstJobQueryContainsOrderByLimit (255s)
2019-04-19 08:08:31: 	Pass: contactHardCreditRollupChunkModeQueryContainsOrderByLimitId (683s)
2019-04-19 08:08:31: 	Pass: contactHardCreditRollupGeneratesIncrementalModeJoinQuery (184s)
2019-04-19 08:08:31: 	Pass: contactHardCreditRollupGeneratesLastNDaysJoinQuery (210s)
2019-04-19 08:08:31: 	Pass: contactHardCreditRollupGeneratesLastNDaysJoinQueryWithCustomSettingFalse (184s)
2019-04-19 08:08:31: 	Pass: contactHardCreditRollupGeneratesLastNYearsJoinQuery (185s)
2019-04-19 08:08:31: 	Pass: contactHardCreditRollupGeneratesStandardJoinQueryWhenNotScheduledJob (197s)
2019-04-19 08:08:31: 	Pass: contactHardCreditRollupWithUserDefinedJoinGeneratesProperJoinQuery (184s)
2019-04-19 08:08:31: 	Pass: contactSoftCreditRollupChunkModeFirstJobQueryContainsOrderByLimit (136s)
2019-04-19 08:08:31: 	Pass: contactSoftCreditRollupChunkModeQueryContainsOrderByLimitId (405s)
2019-04-19 08:08:31: Class: CRLP_ConfigBuilder_TEST
2019-04-19 08:08:31: 	Fail: test_CMTdeployment (145s)
2019-04-19 08:08:31: 	Message: System.NullPointerException: Attempt to de-reference a null object
2019-04-19 08:08:31: 	StackTrace: Class.npsp.CMT_MetadataAPI.MetadataCallBack.handleResult: line 179, column 1
Class.npsp.CRLP_ConfigBuilder_TEST.test_CMTdeployment: line 105, column 1
2019-04-19 08:08:31: Class: CRLP_DefaultConfigBuilder_TEST
2019-04-19 08:08:31: 	Pass: test_createDefaults_diffContact (798s)
2019-04-19 08:08:31: 	Pass: test_createDefaults_simple (837s)
2019-04-19 08:08:31: 	Pass: test_createMembershipDefaults_MembershipRecordTypeDoesNotExist (704s)
2019-04-19 08:08:31: 	Pass: test_excludedRecordTypes_RecordTypeDoesNotExist (463s)
2019-04-19 08:08:31: Class: CRLP_FiscalYears_TEST
2019-04-19 08:08:31: 	Pass: testGetFiscalYearForDate (11s)
2019-04-19 08:08:31: 	Pass: yearStringShouldNotIncludePunctuation (394s)
2019-04-19 08:08:31: Class: CRLP_Operation_TEST
2019-04-19 08:08:31: 	Pass: rollupCmtOperationPicklistShouldMatchEnums (35s)
2019-04-19 08:08:31: 	Pass: test_static_methods (16s)
2019-04-19 08:08:31: 	Pass: timeBoundOperationTypePicklistShouldMatchEnums (15s)
2019-04-19 08:08:31: Class: CRLP_Query_SEL_TEST
2019-04-19 08:08:31: 	Pass: test_ResultsQueryBuilder (439s)
2019-04-19 08:08:31: 	Pass: test_buildCommonQueryFilterOnOpportunity_BuildsValidWhereClause (178s)
2019-04-19 08:08:31: 	Pass: test_buildCommonQueryFilterOnOpportunity_NoFilterGroups (91s)
2019-04-19 08:08:31: 	Pass: test_buildCommonQueryFilterOnOpportunity_NoRollups (22s)
2019-04-19 08:08:31: Class: CRLP_RecalculateBTN_TEST
2019-04-19 08:08:31: 	Pass: test_legacy_rollups (1028s)
2019-04-19 08:08:31: 	Pass: test_new_rollups (588s)
2019-04-19 08:08:31: 	Pass: test_nopermissions (291s)
2019-04-19 08:08:31: Class: CRLP_RollupAccSoftCredit_TEST
2019-04-19 08:08:31: 	Pass: test_Rollups_Batch (3100s)
2019-04-19 08:08:31: 	Pass: test_Rollups_SkewBatch (2501s)
2019-04-19 08:08:31: 	Pass: test_Rollups_Trigger (2490s)
2019-04-19 08:08:31: Class: CRLP_RollupAccount_TEST
2019-04-19 08:08:31: 	Pass: test_Rollups_Batch (4126s)
2019-04-19 08:08:31: 	Pass: test_Rollups_MultiCurrencyBatch (8s)
2019-04-19 08:08:31: 	Pass: test_Rollups_Queueable (3058s)
2019-04-19 08:08:31: 	Pass: test_Rollups_ReparentOppAccount (8932s)
2019-04-19 08:08:31: 	Pass: test_Rollups_SkewBatch (3756s)
2019-04-19 08:08:31: 	Pass: test_Rollups_Trigger (7014s)
2019-04-19 08:08:31: Class: CRLP_RollupContact_TEST
2019-04-19 08:08:31: 	Pass: test_Rollups_AlwaysRollupToPrimaryEnabled (4613s)
2019-04-19 08:08:31: 	Pass: test_Rollups_Batch (4525s)
2019-04-19 08:08:31: 	Pass: test_Rollups_Queueable (4039s)
2019-04-19 08:08:31: 	Pass: test_Rollups_SkewBatch (10096s)
2019-04-19 08:08:31: 	Pass: test_Rollups_Trigger (8997s)
2019-04-19 08:08:31: Class: CRLP_RollupGAU_TEST
2019-04-19 08:08:31: 	Pass: test_Rollups_SkewBatch (4155s)
2019-04-19 08:08:31: Class: CRLP_RollupRecurringDonation_TEST
2019-04-19 08:08:31: 	Pass: test_Rollups_Batch (1051s)
2019-04-19 08:08:31: 	Pass: test_Rollups_Queueable (444s)
2019-04-19 08:08:31: 	Pass: test_Rollups_SkewBatch (816s)
2019-04-19 08:08:31: 	Pass: test_Rollups_Trigger (677s)
2019-04-19 08:08:31: Class: CRLP_RollupScheduler_TEST
2019-04-19 08:08:31: 	Pass: test_schedule_CRLPJobs (1558s)
2019-04-19 08:08:31: 	Pass: test_scheduled_jobs (1526s)
2019-04-19 08:08:31: 	Pass: test_skewdispatcher_job (771s)
2019-04-19 08:08:31: Class: CRLP_RollupSoftCredit_TEST
2019-04-19 08:08:31: 	Pass: test_Rollups_Account (4398s)
2019-04-19 08:08:31: 	Pass: test_Rollups_AlwaysRollupToPrimaryEnabled (4712s)
2019-04-19 08:08:31: 	Pass: test_Rollups_Contact (4567s)
2019-04-19 08:08:31: 	Pass: test_Rollups_ContactSkew (4822s)
2019-04-19 08:08:31: Class: CRLP_RollupUI_TEST
2019-04-19 08:08:31: 	Pass: testGetDeploymentStatus_Rollup (188s)
2019-04-19 08:08:31: 	Pass: testGetFilterGroupDefinitions (28s)
2019-04-19 08:08:31: 	Pass: testGetFilterRuleConstantPicklistOptions (78s)
2019-04-19 08:08:31: 	Pass: testGetRollupDefinitions (36s)
2019-04-19 08:08:31: 	Pass: testSaveFilterGroupAndRules (14s)
2019-04-19 08:08:31: 	Pass: testSaveRollup (24s)
2019-04-19 08:08:31: 	Pass: testSetupFilterGroupDetail (125s)
2019-04-19 08:08:31: 	Pass: testSetupRollupDetail (248s)
2019-04-19 08:08:31: 	Pass: testSetupRollupGrid (54s)
2019-04-19 08:08:31: Class: CRLP_Rollup_SEL_TEST
2019-04-19 08:08:31: 	Pass: shouldMatchUnsupportedOperationsMap (41s)
2019-04-19 08:08:31: 	Pass: shouldReturnExpectedFieldsToQuery (586s)
2019-04-19 08:08:31: 	Pass: shouldReturnExpectedRollupDefinitions (140s)
2019-04-19 08:08:31: 	Pass: shouldValidateFieldDescribes (55s)
2019-04-19 08:08:31: 	Pass: validateRollupSelectorGetterMethodResults (93s)
2019-04-19 08:08:31: Class: CRLP_Rollup_SVC_TEST
2019-04-19 08:08:31: 	Pass: test_get_batch_sizes (464s)
2019-04-19 08:08:31: 	Pass: test_isRecalcNeeded (965s)
2019-04-19 08:08:31: Class: Callable_API_TEST
2019-04-19 08:08:31: 	Pass: callableApiThrowsExceptionWhenActionIsInvalid (26s)
2019-04-19 08:08:31: 	Pass: verifyCallableReturnsAnObject (173s)
2019-04-19 08:08:31: Class: EP_EngagementPlanTaskValidation_TEST
2019-04-19 08:08:31: 	Pass: testCrossTemplateEPDependentTask (372s)
2019-04-19 08:08:31: 	Pass: testMultipleEPDependentTask (197s)
2019-04-19 08:08:31: 	Pass: testRedundantEPDependentTask (295s)
2019-04-19 08:08:31: 	Pass: testSingleEPDependentTask (173s)
2019-04-19 08:08:31: 	Pass: testUpdateCrossTemplateEPDependentTask (227s)
2019-04-19 08:08:31: 	Pass: testUpdateTemplateWithEPDependentTask (240s)
2019-04-19 08:08:31: Class: EP_EngagementPlans_TEST
2019-04-19 08:08:31: 	Pass: testDependentPlan (2993s)
2019-04-19 08:08:31: 	Pass: testPlanUpdate (345s)
2019-04-19 08:08:31: 	Pass: testPlanWithTwoLookups (382s)
2019-04-19 08:08:31: 	Pass: testPlanWithoutLookup (143s)
2019-04-19 08:08:31: 	Pass: testSkipWeekendsFriday (701s)
2019-04-19 08:08:31: 	Pass: testSkipWeekendsMonday (867s)
2019-04-19 08:08:31: 	Pass: testTaskAssignment (369s)
2019-04-19 08:08:31: 	Pass: test_getsobjectparentpath (34s)
2019-04-19 08:08:31: Class: EP_ManageEPTemplate_CTRL_TEST
2019-04-19 08:08:31: 	Pass: testClone (1207s)
2019-04-19 08:08:31: 	Pass: testDependentPlan (1046s)
2019-04-19 08:08:31: 	Pass: testResaveSucceedsWhenErrorIsFixed (592s)
2019-04-19 08:08:31: 	Pass: testSaveFailsWhenNewTaskHasNoName (222s)
2019-04-19 08:08:31: 	Pass: testSaveRollsBackAllDmlsOnError (520s)
2019-04-19 08:08:31: Class: EP_TaskDependency_TEST
2019-04-19 08:08:31: 	Pass: testDelayType (1311s)
2019-04-19 08:08:31: 	Pass: testDeleteDependentTask (1045s)
2019-04-19 08:08:31: 	Pass: testDeletedPlan (920s)
2019-04-19 08:08:31: 	Pass: testDependentPlan (1102s)
2019-04-19 08:08:31: Class: EP_TaskRollup_TEST
2019-04-19 08:08:31: 	Pass: testDeleteCompletedEPTask (1565s)
2019-04-19 08:08:31: 	Pass: testMultipleEPTasks (829s)
2019-04-19 08:08:31: 	Pass: testMultipleEPTasksAndPlans (975s)
2019-04-19 08:08:31: 	Pass: testMultipleTasks (126s)
2019-04-19 08:08:31: 	Pass: testSingleEPTask (568s)
2019-04-19 08:08:31: 	Pass: testSingleTask (98s)
2019-04-19 08:08:31: 	Pass: testUnrelateEPTask (830s)
2019-04-19 08:08:31: 	Pass: testUpdateMultipleEPTask (1000s)
2019-04-19 08:08:31: Class: ERR_AddError_TEST
2019-04-19 08:08:31: 	Pass: databaseDml (554s)
2019-04-19 08:08:31: Class: ERR_AsyncErrors_TEST
2019-04-19 08:08:31: 	Pass: testInsertsErrors (14s)
2019-04-19 08:08:31: 	Pass: testQueriesForErrorsInCurrentNamespace (10s)
2019-04-19 08:08:31: 	Pass: testQueryForErrorsInLastDayIfNotPreviouslyRun (10s)
2019-04-19 08:08:31: 	Pass: testQueryForErrorsSinceLastRun (11s)
2019-04-19 08:08:31: 	Pass: testSendsNotifications (11s)
2019-04-19 08:08:31: 	Pass: testUpdatesLastRunSetting (11s)
2019-04-19 08:08:31: Class: ERR_ExceptionHandler_TEST
2019-04-19 08:08:31: 	Pass: testHandleException (204s)
2019-04-19 08:08:31: 	Pass: testUnhandledExceptionIsUnmodified (5s)
2019-04-19 08:08:31: Class: ERR_Handler_CTRL_TEST
2019-04-19 08:08:31: Class: ERR_Handler_TEST
2019-04-19 08:08:31: 	Pass: controllerWithManualRollback (1574s)
2019-04-19 08:08:31: 	Pass: errorStoredInDatabaseFromInsert (707s)
2019-04-19 08:08:31: 	Pass: errorsStoredInDbTdtmCustomConfigEmailErrors (400s)
2019-04-19 08:08:31: 	Pass: errorsStoredInDbTdtmCustomConfigPostToChatter (144s)
2019-04-19 08:08:31: 	Pass: testInactiveUserEmailBehavior (386s)
2019-04-19 08:08:31: Class: ERR_Notifier_TEST
2019-04-19 08:08:31: 	Pass: testGetSystemAdminEmails (52s)
2019-04-19 08:08:31: Class: ERR_ParentAccountUpdater2_TEST
2019-04-19 08:08:31: Class: ERR_ParentAccountUpdater_TEST
2019-04-19 08:08:31: Class: HH_CampaignDedupeBTN_TEST
2019-04-19 08:08:31: 	Pass: testCampaignHHReport (1305s)
2019-04-19 08:08:31: Class: HH_Container_TEST
2019-04-19 08:08:31: 	Pass: saveShouldAddRemovedContactToNewHousehold (1975s)
2019-04-19 08:08:31: 	Pass: saveShouldResultInOneDefaultAddressWhenContactsAreAddedToTheHousehold (2719s)
2019-04-19 08:08:31: 	Pass: testAddContactAddresses (926s)
2019-04-19 08:08:31: 	Pass: testAutoCompleteDataProvider (975s)
2019-04-19 08:08:31: 	Pass: testAutoCompleteIsValidSearchQuery (13s)
2019-04-19 08:08:31: 	Pass: testAutoCompleteReturnsEmptyListForEncryptedContactNameAndInvalidSearchQuery (895s)
2019-04-19 08:08:31: 	Pass: testAutoCompleteReturnsRecordsForEncryptedContactNameAndValidSearchQuery (955s)
2019-04-19 08:08:31: 	Pass: testContactSoqlIsCorrect (597s)
2019-04-19 08:08:31: 	Pass: testContactsAreReturnedWhenHHNamingSettingsIsInvalidAndAutomaticHHNamingIsOff (1064s)
2019-04-19 08:08:31: 	Pass: testGetAddresses (939s)
2019-04-19 08:08:31: 	Pass: testGetContactFieldsReturnsExpectedFieldNames (18s)
2019-04-19 08:08:31: 	Pass: testGetHHGetContacts (959s)
2019-04-19 08:08:31: 	Pass: testGetSalutations (15s)
2019-04-19 08:08:31: 	Pass: testHHNameAndGreetingsAreModifiedWhenAutomaticHHNamingIsOn (802s)
2019-04-19 08:08:31: 	Pass: testHHNameAndGreetingsAreNotModifiedWhenAutomaticHHNamingIsOff (788s)
2019-04-19 08:08:31: 	Pass: testMergeHouseholds (1708s)
2019-04-19 08:08:31: 	Pass: testPackageLabels (14s)
2019-04-19 08:08:31: 	Pass: testUpdateHousehold (1178s)
2019-04-19 08:08:31: 	Pass: testUpsertContacts (1409s)
2019-04-19 08:08:31: 	Pass: testUpsertContactsRollsBackAllDmlsOnError (1188s)
2019-04-19 08:08:31: Class: HH_HouseholdNamingSettingValidator_TEST
2019-04-19 08:08:31: 	Pass: testErrorWhenClassDoesNotExist (26s)
2019-04-19 08:08:31: 	Pass: testErrorWhenClassDoesNotImplementINamingInterface (15s)
2019-04-19 08:08:31: 	Pass: testErrorWhenFormalGreetingFormatIsInvalid (70s)
2019-04-19 08:08:31: 	Pass: testErrorWhenHHNameFormatIsInvalid (36s)
2019-04-19 08:08:31: 	Pass: testErrorWhenInformalGreetingFormatIsInvalid (46s)
2019-04-19 08:08:31: 	Pass: testErrorsWhenAllFormatFieldsAreInvalid (35s)
2019-04-19 08:08:31: 	Pass: testInvalidClassErrorWhenClassAndFormatFieldsAreInvalid (16s)
2019-04-19 08:08:31: 	Pass: testSuccessWhenAllHHSettingsFieldsAreValid (33s)
2019-04-19 08:08:31: 	Pass: testSuccessWhenClassImplementsINamingInterface (12s)
2019-04-19 08:08:31: 	Pass: testSuccessWhenClassIsNotSpecified (11s)
2019-04-19 08:08:31: 	Pass: testSuccessWhenFormatFieldIsNull (32s)
2019-04-19 08:08:31: Class: HH_HouseholdNaming_TEST
2019-04-19 08:08:31: 	Pass: HouseholdNamingTest (2888s)
2019-04-19 08:08:31: 	Pass: HouseholdNamingUpdateTest (2115s)
2019-04-19 08:08:31: 	Pass: testBatch (661s)
2019-04-19 08:08:31: 	Pass: testCaseChanges (530s)
2019-04-19 08:08:31: 	Pass: testGetHouseholdContactsReturnsDataForSpecifiedHHOnly (541s)
2019-04-19 08:08:31: 	Pass: testGetHouseholdContactsReturnsEmptyList (188s)
2019-04-19 08:08:31: 	Pass: testIsAutomaticNamingReturnsFalseWhenAutomaticHHNamingIsOff (10s)
2019-04-19 08:08:31: 	Pass: testIsAutomaticNamingReturnsTrueWhenAutomaticHHNamingIsOn (10s)
2019-04-19 08:08:31: 	Pass: testNamingOrder (1822s)
2019-04-19 08:08:31: 	Pass: testNamingOrder2 (736s)
2019-04-19 08:08:31: 	Pass: testNoFieldIsReturnedWhenAutomaticHHNamingIsOff (11s)
2019-04-19 08:08:31: 	Pass: testReturnedFieldsWhenAutomaticHHNamingIsOn (13s)
2019-04-19 08:08:31: 	Pass: testSoqlContainsHHNamingFieldsWhenAutomaticHHNamingIsOn (22s)
2019-04-19 08:08:31: 	Pass: testSoqlDoesNotContainHHNamingFieldsWhenAutomaticHHNamingIsOff (17s)
2019-04-19 08:08:31: 	Pass: testUpdateNamesIsAppliedToSpecifiedHHsOnly (492s)
2019-04-19 08:08:31: Class: HH_Households_TEST
2019-04-19 08:08:31: 	Pass: Households_Test (12s)
2019-04-19 08:08:31: 	Pass: contactDeleteWithOwnHousehold (1029s)
2019-04-19 08:08:31: 	Pass: contactDeleteWithSharedHousehold (1118s)
2019-04-19 08:08:31: 	Pass: deleteEmptyHouseholds_test (1055s)
2019-04-19 08:08:31: 	Pass: newIndContactAllContactsProcessor (931s)
2019-04-19 08:08:31: 	Pass: newIndContactIndividualsProcessor (952s)
2019-04-19 08:08:31: 	Pass: newNoHouseholdProcessor (288s)
2019-04-19 08:08:31: 	Pass: newOrgContactAllContactsProcessor (878s)
2019-04-19 08:08:31: 	Pass: newOrgContactIndividualsProcessor (355s)
2019-04-19 08:08:31: 	Pass: newPrivateContactAllContactsProcessor (720s)
2019-04-19 08:08:31: 	Pass: testBulk (17847s)
2019-04-19 08:08:31: 	Pass: testCaseChanges (724s)
2019-04-19 08:08:31: 	Pass: testContactDmlWhenAutomaticHHNamingIsOff (639s)
2019-04-19 08:08:31: 	Pass: testHouseholdExclusion (960s)
2019-04-19 08:08:31: 	Pass: testMergeRollupSupport (1168s)
2019-04-19 08:08:31: 	Pass: testNewAndUpdateContactWithHHNaming (788s)
2019-04-19 08:08:31: Class: HH_ManageHH_TEST
2019-04-19 08:08:31: 	Pass: testExistingHHAccount (480s)
2019-04-19 08:08:31: 	Pass: testExistingHHObject (199s)
2019-04-19 08:08:31: 	Pass: testNewHHObject (685s)
2019-04-19 08:08:31: Class: HH_NameSpec_TEST
2019-04-19 08:08:31: 	Pass: OneAnonymousContact (23s)
2019-04-19 08:08:31: 	Pass: OneContact (23s)
2019-04-19 08:08:31: 	Pass: OneContactXReferences (839s)
2019-04-19 08:08:31: 	Pass: SixContactsOneLastnamesContactOverrun (34s)
2019-04-19 08:08:31: 	Pass: SixContactsTwoLastnamesContactOverrun (55s)
2019-04-19 08:08:31: 	Pass: ThreeContactsTwoLastNamesNotInSequenceWhenTheNameFormatHasLastName (32s)
2019-04-19 08:08:31: 	Pass: ThreeContactsTwoLastNamesNotInSequenceWhenTheNameFormatHasNoLastName (22s)
2019-04-19 08:08:31: 	Pass: ThreeContactsTwoLastnames (27s)
2019-04-19 08:08:31: 	Pass: ThreeContactsTwoLastnamesCustomFields (31s)
2019-04-19 08:08:31: 	Pass: TwoContactDifferentLastname (23s)
2019-04-19 08:08:31: 	Pass: TwoContactSameLastname (23s)
2019-04-19 08:08:31: 	Pass: TwoContactSameLastnameAccountReference (22s)
2019-04-19 08:08:31: 	Pass: testHHNamingWhenContactFieldNamesAreCaseInsensitive (26s)
2019-04-19 08:08:31: 	Pass: testRefreshAllHHNaming (1426s)
2019-04-19 08:08:31: 	Pass: testRefreshAllHHNamingManyHH (9874s)
2019-04-19 08:08:31: 	Pass: testRefreshAllHHNamingWithCustom (1247s)
2019-04-19 08:08:31: Class: HH_OppContactRoles_TEST
2019-04-19 08:08:31: 	Pass: ghIssue25 (1040s)
2019-04-19 08:08:31: 	Pass: opportunityDeceasedPrimaryAccount (968s)
2019-04-19 08:08:31: 	Pass: opportunityRegularAccountHHAccount (741s)
2019-04-19 08:08:31: 	Pass: opportunityRegularAccountOne2One (716s)
2019-04-19 08:08:31: 	Pass: opportunityWithHouseholdBucket (994s)
2019-04-19 08:08:31: 	Pass: opportunityWithHouseholdHHAccount (1480s)
2019-04-19 08:08:31: 	Pass: opportunityWithHouseholdNoRolesBucket (764s)
2019-04-19 08:08:31: 	Pass: opportunityWithHouseholdNoRolesHHAccount (1152s)
2019-04-19 08:08:31: 	Pass: opportunityWithHouseholdNoRolesOne2One (1094s)
2019-04-19 08:08:31: 	Pass: opportunityWithHouseholdOne2One (1460s)
2019-04-19 08:08:31: 	Pass: opportunityWithNoHouseholdHHAccount (918s)
2019-04-19 08:08:31: 	Pass: opportunityWithNoHouseholdOne2One (1329s)
2019-04-19 08:08:31: 	Pass: shouldNotCreateOcrsWhenOppDisableContactRoleAutomationIsChecked (1632s)
2019-04-19 08:08:31: 	Pass: testOppsAcctChangeHHToHH (2226s)
2019-04-19 08:08:31: 	Pass: testOppsAcctChangeHHToOrg (1569s)
2019-04-19 08:08:31: 	Pass: testOppsAcctChangeOne2OneToOne2One (1150s)
2019-04-19 08:08:31: 	Pass: testOppsAcctChangeOne2OneToOrg (1131s)
2019-04-19 08:08:31: 	Pass: testOppsAcctChangeOrgToHH (1545s)
2019-04-19 08:08:31: 	Pass: testOppsAcctChangeOrgToOne2One (1226s)
2019-04-19 08:08:31: 	Pass: updateOppHHAccountRefreshNone (2686s)
2019-04-19 08:08:31: 	Pass: updateOppHHAccountRefreshOpen (2879s)
2019-04-19 08:08:31: 	Pass: updateOppHHAccountRefreshOpenAndClosed (2378s)
2019-04-19 08:08:31: Class: LD_LeadConvertOverride_TEST
2019-04-19 08:08:31: 	Pass: accFinderBuildsCorrectSearchQuery (402s)
2019-04-19 08:08:31: 	Pass: contactFinderBuildsCorrectSOQLQuery (546s)
2019-04-19 08:08:31: 	Pass: contactFinderBuildsCorrectSearchQuery (187s)
2019-04-19 08:08:31: 	Pass: convertCompanyLead_Test (941s)
2019-04-19 08:08:31: 	Pass: mergeLeadConversion_TestBucketAccountOppOCR (931s)
2019-04-19 08:08:31: 	Pass: mergeLeadConversion_TestHHAccountOppOCR (996s)
2019-04-19 08:08:31: 	Pass: mergeLeadConversion_TestOne2OneOppOCR (874s)
2019-04-19 08:08:31: 	Pass: newLeadConversionExistingNamedCompanyAffl_TestBucketAccount (689s)
2019-04-19 08:08:31: 	Pass: newLeadConversionExistingNamedCompanyAffl_TestHHAccount (1092s)
2019-04-19 08:08:31: 	Pass: newLeadConversionExistingNamedCompanyAffl_TestOne2One (699s)
2019-04-19 08:08:31: 	Pass: newLeadConversionExistingNamedCompany_TestBucketAccount (677s)
2019-04-19 08:08:31: 	Pass: newLeadConversionExistingNamedCompany_TestHHAccount (661s)
2019-04-19 08:08:31: 	Pass: newLeadConversionExistingNamedCompany_TestOne2One (777s)
2019-04-19 08:08:31: 	Pass: newLeadConversionHHObjBucket (929s)
2019-04-19 08:08:31: 	Pass: newLeadConversionHHObjOne2One (851s)
2019-04-19 08:08:31: 	Pass: newLeadConversionMerge_TestBucketAccount (569s)
2019-04-19 08:08:31: 	Pass: newLeadConversionMerge_TestHHAccount (775s)
2019-04-19 08:08:31: 	Pass: newLeadConversionMerge_TestOne2One (646s)
2019-04-19 08:08:31: 	Pass: newLeadConversionNewNamedCompany_TestBucketAccount (601s)
2019-04-19 08:08:31: 	Pass: newLeadConversionNewNamedCompany_TestHHAccount (597s)
2019-04-19 08:08:31: 	Pass: newLeadConversionNewNamedCompany_TestOne2One (642s)
2019-04-19 08:08:31: 	Pass: newLeadConversion_TestBucketAccount (551s)
2019-04-19 08:08:31: 	Pass: newLeadConversion_TestBucketAccountOppAFF (935s)
2019-04-19 08:08:31: 	Pass: newLeadConversion_TestBucketAccountOppOCR (660s)
2019-04-19 08:08:31: 	Pass: newLeadConversion_TestHHAccount (811s)
2019-04-19 08:08:31: 	Pass: newLeadConversion_TestHHAccountOppAFF (1352s)
2019-04-19 08:08:31: 	Pass: newLeadConversion_TestHHAccountOppOCR (1068s)
2019-04-19 08:08:31: 	Pass: newLeadConversion_TestOne2One (539s)
2019-04-19 08:08:31: 	Pass: newLeadConversion_TestOne2OneOppAFF (1382s)
2019-04-19 08:08:31: 	Pass: newLeadConversion_TestOne2OneOppOCR (754s)
2019-04-19 08:08:31: 	Pass: newNativeLeadConversion_TestBucketAccount (711s)
2019-04-19 08:08:31: 	Pass: newNativeLeadConversion_TestHHAccount (1189s)
2019-04-19 08:08:31: 	Pass: newNativeLeadConversion_TestOne2One (838s)
2019-04-19 08:08:31: Class: LVL_LevelAssignBATCH_TEST
2019-04-19 08:08:31: 	Pass: ladderConstructorShouldSetTarget (24s)
2019-04-19 08:08:31: 	Pass: previousLevelShouldBePopulatedWhenCurrentLevelIsChangedToBlank (6238s)
2019-04-19 08:08:31: 	Pass: previousLevelShouldNotChangeWhenCurrentLevelDoesNotChange (781s)
2019-04-19 08:08:31: 	Pass: shouldBuildQueryForLevel (13s)
2019-04-19 08:08:31: 	Pass: shouldBuildQueryWithLastRunFilter (41s)
2019-04-19 08:08:31: 	Pass: shouldExcludeFilterWhenAnyLevelIsUpdatedAfterLastRun (107s)
2019-04-19 08:08:31: 	Pass: shouldExcludeFilterWhenSourceIsFormula (9s)
2019-04-19 08:08:31: 	Pass: testAccountLevels (1314s)
2019-04-19 08:08:31: 	Pass: testContactLevels (1526s)
2019-04-19 08:08:31: 	Pass: testContactLevelsChange (1435s)
2019-04-19 08:08:31: 	Pass: testLevelAssignScheduling (1581s)
2019-04-19 08:08:31: 	Pass: testLevelValidationExistingMax (156s)
2019-04-19 08:08:31: 	Pass: testLevelValidationExistingMin (151s)
2019-04-19 08:08:31: 	Pass: testLevelValidationExistingNames (151s)
2019-04-19 08:08:31: 	Pass: testLevelValidationMinMaxMustExist (103s)
2019-04-19 08:08:31: 	Pass: testLevelValidationMinMaxOverlap (202s)
2019-04-19 08:08:31: 	Pass: testLevelValidationNewMax (119s)
2019-04-19 08:08:31: 	Pass: testLevelValidationNewMin (110s)
2019-04-19 08:08:31: 	Pass: testLevelValidationNewNames (120s)
2019-04-19 08:08:31: Class: LVL_LevelEdit_TEST
2019-04-19 08:08:31: 	Pass: testCloneLevel (295s)
2019-04-19 08:08:31: 	Pass: testNewLevel (127s)
2019-04-19 08:08:31: 	Pass: testSaveAndNewLevel (166s)
2019-04-19 08:08:31: 	Pass: testTargetFieldChange (135s)
2019-04-19 08:08:31: Class: MTCH_FindGifts_TEST
2019-04-19 08:08:31: 	Pass: testCreateMatches (4089s)
2019-04-19 08:08:31: 	Pass: testCreateMatchesPercent (2219s)
2019-04-19 08:08:31: 	Pass: testCreateSearchedMatches (2186s)
2019-04-19 08:08:31: 	Pass: testSaveAndCloseRollsBackAllDmlsOnError (2780s)
2019-04-19 08:08:31: 	Pass: testUnmatchMatches (2546s)
2019-04-19 08:08:31: Class: MTCH_Opportunity_TEST
2019-04-19 08:08:31: 	Pass: testCreateMatches (2675s)
2019-04-19 08:08:31: Class: OPP_AutomatedSoftCreditsService_TEST
2019-04-19 08:08:31: 	Pass: testBuildAffiliationOCRs (116s)
2019-04-19 08:08:31: 	Pass: testBuildRelationshipOCRs (166s)
2019-04-19 08:08:31: 	Pass: testCreateAffiliationOCRs (43s)
2019-04-19 08:08:31: 	Pass: testCreateRelationshipOCRs (25s)
2019-04-19 08:08:31: 	Pass: testIsDuplicateOCR (53s)
2019-04-19 08:08:31: 	Pass: testIsNotDuplicateOCR (110s)
2019-04-19 08:08:31: 	Pass: testOpportunityAccountClassificationIsIndividual (90s)
2019-04-19 08:08:31: 	Pass: testOpportunityAccountClassificationIsOrganization (98s)
2019-04-19 08:08:31: 	Pass: testRemoveDuplicateAssociatedRecordsForAffiliations (108s)
2019-04-19 08:08:31: 	Pass: testRemoveDuplicateAssociatedRecordsForRelationships (188s)
2019-04-19 08:08:31: 	Pass: testRetrieveAffiliations (33s)
2019-04-19 08:08:31: 	Pass: testRetrieveOpportunityContactRoles (38s)
2019-04-19 08:08:31: 	Pass: testRetrieveRelationships (37s)
2019-04-19 08:08:31: Class: OPP_CampaignMember_TEST
2019-04-19 08:08:31: 	Pass: batchCreateMixedMembers (9879s)
2019-04-19 08:08:31: 	Pass: createMemberNonResponded (1071s)
2019-04-19 08:08:31: 	Pass: createMemberResponded (1282s)
2019-04-19 08:08:31: 	Pass: featureOff (1160s)
2019-04-19 08:08:31: 	Pass: newMemberCreateStatus (1320s)
2019-04-19 08:08:31: 	Pass: omitCampaignMember (1173s)
2019-04-19 08:08:31: 	Pass: settingUsesExistingStatus (1403s)
2019-04-19 08:08:31: 	Pass: updateMemberCreateStatus (1340s)
2019-04-19 08:08:31: 	Pass: updateStatus (1299s)
2019-04-19 08:08:31: Class: OPP_CascadeDeleteLookups_TEST
2019-04-19 08:08:31: 	Pass: testOppCascade (1052s)
2019-04-19 08:08:31: 	Pass: testOppCascadeWithPaymentAllocations (906s)
2019-04-19 08:08:31: Class: OPP_CurrencySync_TEST
2019-04-19 08:08:31: 	Pass: testCurrencyCodeSync (7s)
2019-04-19 08:08:31: Class: OPP_MatchingDonationsBTN_TEST
2019-04-19 08:08:31: 	Pass: TestMatchingDonationPage (753s)
2019-04-19 08:08:31: Class: OPP_OpportunityContactRoles_TEST
2019-04-19 08:08:31: 	Pass: avoidDuplicateCRs (1006s)
2019-04-19 08:08:31: 	Pass: createOrUpdateCRForIndividualAccount (509s)
2019-04-19 08:08:31: 	Pass: honoreeNotificationBlankSettings (702s)
2019-04-19 08:08:31: 	Pass: honoreeNotificationInsert (741s)
2019-04-19 08:08:31: 	Pass: honoreeNotificationUpdate (932s)
2019-04-19 08:08:31: 	Pass: oppCRTriggerTurnedOff (436s)
2019-04-19 08:08:31: 	Pass: oppRolesForBadId (108s)
2019-04-19 08:08:31: 	Pass: oppRolesForIndividualAccount (372s)
2019-04-19 08:08:31: 	Pass: oppRolesForIndividualContact (364s)
2019-04-19 08:08:31: 	Pass: oppRolesForOneToOneAccount (444s)
2019-04-19 08:08:31: 	Pass: oppRolesForOneToOneContact (517s)
2019-04-19 08:08:31: 	Pass: shouldAutomateSoftCreditOcrsOnlyForOppsWithDisableContactRoleAutomationIsUnchecked (1262s)
2019-04-19 08:08:31: 	Pass: shouldNotCreateAffiliationOcrsWhenOppDisableContactRoleAutomationIsChecked (1203s)
2019-04-19 08:08:31: 	Pass: shouldNotCreateOcrsOnOppInsertWhenDisableContactRoleAutomationIsChecked (1287s)
2019-04-19 08:08:31: 	Pass: shouldNotCreatePrimaryOcrOnOppUpdateWhenDisableContactRoleAutomationIsChecked (880s)
2019-04-19 08:08:31: 	Pass: shouldNotCreateRelationshipOcrsWhenOppDisableContactRoleAutomationIsChecked (2199s)
2019-04-19 08:08:31: 	Pass: shouldNotUpdateOcrOnOppUpdateWhenDisableContactRoleAutomationIsChecked (889s)
2019-04-19 08:08:31: 	Pass: testClearOCRs (1268s)
2019-04-19 08:08:31: 	Pass: testCreateUpdateCRForOrganizationalAccount (462s)
2019-04-19 08:08:31: 	Pass: testOppAccountIdChanges (966s)
2019-04-19 08:08:31: 	Pass: testPopulateAccountDetails (1391s)
2019-04-19 08:08:31: 	Pass: testPopulateAccountToOpportunities (1619s)
2019-04-19 08:08:31: 	Pass: testPopulatePrimaryContactToOpportunities (1219s)
2019-04-19 08:08:31: 	Pass: testPopulateTransactionOCRs (1100s)
2019-04-19 08:08:31: 	Pass: testUpdatingPrimaryContact (957s)
2019-04-19 08:08:31: Class: OPP_OpportunityNaming_BATCH_TEST
2019-04-19 08:08:31: 	Pass: shouldChainNextBatchOffsetByLastRecordProcessed (515s)
2019-04-19 08:08:31: 	Pass: shouldLimitQuery (39s)
2019-04-19 08:08:31: 	Pass: shouldNotChainNextBatchIfLastOppIdProcessedIsNull (20s)
2019-04-19 08:08:31: 	Pass: shouldNotChainNextBatchIfThereAreNoMoreRecordsToProcess (36s)
2019-04-19 08:08:31: 	Pass: shouldQueryAllOpportunitiesInIdOrder (52s)
2019-04-19 08:08:31: 	Pass: shouldQueryOffsetOpportunitiesWhenGivenId (49s)
2019-04-19 08:08:31: 	Pass: shouldRenameOpportunitiesInChunks (490s)
2019-04-19 08:08:31: 	Pass: shouldTrackLastOpportunityIdProcessed (204s)
2019-04-19 08:08:31: Class: OPP_OpportunityNaming_TEST
2019-04-19 08:08:31: 	Pass: testBulk (2396s)
2019-04-19 08:08:31: 	Pass: testButton (986s)
2019-04-19 08:08:31: 	Pass: testException (886s)
2019-04-19 08:08:31: 	Pass: testMissingData (856s)
2019-04-19 08:08:31: Class: OPP_PrimaryContactRoleMerge_TEST
2019-04-19 08:08:31: 	Pass: shouldRemoveDuplicatePrimaryOcrsWhenOppDisableContactRoleAutomationIsChecked (975s)
2019-04-19 08:08:31: 	Pass: test_NonOrganizational_DeleteBlankAndNonNPSPRole (454s)
2019-04-19 08:08:31: 	Pass: test_NonOrganizational_LogErrorIf_NoPrimaryOCRsWithRoleDefinedInNPSPSettings (477s)
2019-04-19 08:08:31: 	Pass: test_Organization_LogErrorIf_NoPrimaryOCRsWithRoleDefinedInNPSPSettings (373s)
2019-04-19 08:08:31: 	Pass: test_Organizational_DeleteBlankAndNonNPSPRole (435s)
2019-04-19 08:08:31: Class: OPP_PrimaryContact_TEST
2019-04-19 08:08:31: 	Pass: shouldCreateOCRsOnBulkOppInsert (6986s)
2019-04-19 08:08:31: 	Pass: shouldRecreateOCRsWhenPrimaryContactFieldOnOppIsUpdated (1398s)
2019-04-19 08:08:31: 	Pass: shouldUpdateCreateOrDeleteOCRsBasedPrimaryContactFieldOnOppChange (1392s)
2019-04-19 08:08:31: 	Pass: shouldUpdatePrimaryContactOnOppBasedOnPrimaryOCRContact (1406s)
2019-04-19 08:08:31: Class: OPP_SendAcknowledgmentBTN_TEST
2019-04-19 08:08:31: 	Pass: shouldDisplayErrorWhenNoOppSelected (49s)
2019-04-19 08:08:31: 	Pass: shouldNotSendAckWhenAlreadySent (3058s)
2019-04-19 08:08:31: 	Pass: testSendAcknowledgment (721s)
2019-04-19 08:08:31: 	Pass: testSendAcknowledgmentRollsBackAllDmlsOnError (708s)
2019-04-19 08:08:31: Class: OPP_StageMappingUtil_TEST
2019-04-19 08:08:31: 	Pass: testCallableAPISupport (1446s)
2019-04-19 08:08:31: 	Pass: testdetermineOppStateFromOppStageWithSettingsMethod (6s)
2019-04-19 08:08:31: Class: PMT_CascadeDeleteLookups_TEST
2019-04-19 08:08:31: 	Pass: testPaymentCascade (1537s)
2019-04-19 08:08:31: Class: PMT_PaymentCreator_TEST
2019-04-19 08:08:31: 	Pass: CloseLostOppWithMixOfPayments (1378s)
2019-04-19 08:08:31: 	Pass: createOppWithRecordTypeExcluded (256s)
2019-04-19 08:08:31: 	Pass: createOppWithTypeExcluded (229s)
2019-04-19 08:08:31: 	Pass: createOppWithTypeNotExcluded (349s)
2019-04-19 08:08:31: 	Pass: nullAmount (472s)
2019-04-19 08:08:31: 	Pass: testBatchPaymentCreation (607s)
2019-04-19 08:08:31: 	Pass: testClosedLostOpportunity_UpdateAmountFromNullToValue (3229s)
2019-04-19 08:08:31: 	Pass: testClosedLostOpportunity_UpdateAmountFromZeroToValue (3080s)
2019-04-19 08:08:31: 	Pass: testClosedWonOpportunity_UpdateAmountFromNullToValue (4217s)
2019-04-19 08:08:31: 	Pass: testClosedWonOpportunity_UpdateAmountFromZeroToValue (4480s)
2019-04-19 08:08:31: 	Pass: testOpenOpportunity_UpdateAmountFromNullToValue (4171s)
2019-04-19 08:08:31: 	Pass: testOpenOpportunity_UpdateAmountFromZeroToValue (3710s)
2019-04-19 08:08:31: 	Pass: testOpportunityAutoClosingWithMulticurrency (9s)
2019-04-19 08:08:31: 	Pass: testOpportunityAutoClosingWithoutMulticurrency (463s)
2019-04-19 08:08:31: 	Pass: testOpportunityWillAutoCloseIfAmountUpdatedToMatchPayments (658s)
2019-04-19 08:08:31: 	Pass: testOpportunityWillAutoClosefterAllPaymentsReceived (328s)
2019-04-19 08:08:31: 	Pass: testOpportunityWillNotAutoCloseClosesIfAmountSetToZero (435s)
2019-04-19 08:08:31: 	Pass: testOpportunityWillNotAutoCloseIfAllPaymentsWrittenOff (309s)
2019-04-19 08:08:31: 	Pass: testOpportunityWillNotAutoCloseIfAlreadyClosed (560s)
2019-04-19 08:08:31: 	Pass: testOpportunityWillNotAutoCloseIfNoStageNameSet (301s)
2019-04-19 08:08:31: 	Pass: testOpportunityWillNotAutoCloseIfNotAllPaymentsReceived (500s)
2019-04-19 08:08:31: Class: PMT_PaymentWizard_TEST
2019-04-19 08:08:31: 	Pass: testNoAccessMessageIsDisplayedWhenCreatePaymentByUserWithoutAccessOnPayments (883s)
2019-04-19 08:08:31: 	Pass: testNoAccessMessageIsDisplayedWhenWriteoffByUserWithoutAccessOnPayments (609s)
2019-04-19 08:08:31: 	Pass: testOppNotFoundMessageWhenOppIdDoesNotExist (31s)
2019-04-19 08:08:31: 	Pass: testOppNotFoundMessageWhenTypePageParamIsInvalid (351s)
2019-04-19 08:08:31: 	Pass: testOppNotFoundMessageWhenTypePageParamIsInvalidAndUserHasNoAccessOnPayments (476s)
2019-04-19 08:08:31: 	Pass: testPageElementsMonthly (917s)
2019-04-19 08:08:31: 	Pass: testPageElementsWeekly (682s)
2019-04-19 08:08:31: 	Pass: testPageElementsYearly (633s)
2019-04-19 08:08:31: 	Pass: testPaymentMappingsApplied (877s)
2019-04-19 08:08:31: 	Pass: testPaymentsEnabledWhenWriteOff (917s)
2019-04-19 08:08:31: 	Pass: testPublicGetters (22s)
2019-04-19 08:08:31: 	Pass: testRemovePaidPayments (939s)
2019-04-19 08:08:31: Class: PMT_Payment_TEST
2019-04-19 08:08:31: 	Pass: testOpportunityWillAutoCloseWithACMEnabled (1087s)
2019-04-19 08:08:31: 	Pass: test_BlockPaymentCurrencyChange (10s)
2019-04-19 08:08:31: 	Pass: test_UpdatePaymentCurrencyFromOpportunity (10s)
2019-04-19 08:08:31: 	Pass: test_newPaymentCurrencyMatchesOpportunity (10s)
2019-04-19 08:08:31: Class: PSC_ManageSoftCredits_TEST
2019-04-19 08:08:31: 	Pass: createNewPSCs (1879s)
2019-04-19 08:08:31: 	Pass: createNewPSCsByPercent (1226s)
2019-04-19 08:08:31: 	Pass: createNewPSCsToExistingPSCs (1383s)
2019-04-19 08:08:31: 	Pass: deleteExistingPSCs (1457s)
2019-04-19 08:08:31: 	Pass: loadInvalidPSCs (1150s)
2019-04-19 08:08:31: 	Pass: loadSoftCreditOCRs (1145s)
2019-04-19 08:08:31: 	Pass: makeExistingPSCsFullCredits (1248s)
2019-04-19 08:08:31: 	Pass: makeNewPSCsFullCredits (1140s)
2019-04-19 08:08:31: 	Pass: shouldDisplayMessageWhenUserDoesNotHavePermissions (1478s)
2019-04-19 08:08:31: 	Pass: testErrors (1239s)
2019-04-19 08:08:31: 	Pass: testNoSoftCreditRoles (1130s)
2019-04-19 08:08:31: 	Pass: testResaveSucceedsWhenErrorIsFixed (1301s)
2019-04-19 08:08:31: 	Pass: testSaveRollsBackAllDmlsOnError (1247s)
2019-04-19 08:08:31: 	Pass: updateExistingPSCs (1295s)
2019-04-19 08:08:31: 	Pass: verifyEmptyContactRecordsAreNotSaved (1192s)
2019-04-19 08:08:31: Class: PSC_PartialSoftCredit_TEST
2019-04-19 08:08:31: 	Pass: createDupePSCsNewOCRs (19038s)
2019-04-19 08:08:31: 	Pass: createPSCsExistingOCRs (1967s)
2019-04-19 08:08:31: 	Pass: createPSCsNewOCRs (1169s)
2019-04-19 08:08:31: 	Pass: createPSCsSomeExistingOCRs (1792s)
2019-04-19 08:08:31: 	Pass: updatePSCsInvalidFields (1617s)
2019-04-19 08:08:31: 	Pass: updatePSCsRoleName (1746s)
2019-04-19 08:08:31: Class: RD_BulkTests_TEST
2019-04-19 08:08:31: 	Pass: bulkInsertOpportunities (10265s)
2019-04-19 08:08:31: Class: RD_CascadeDeleteLookups_TEST
2019-04-19 08:08:31: 	Pass: testRDCascade (1024s)
2019-04-19 08:08:31: 	Pass: testRDDeleteException (236s)
2019-04-19 08:08:31: 	Pass: testRDDeleteException_ClassicThemeContext (222s)
2019-04-19 08:08:31: 	Pass: testRDDeleteException_LightningThemeContext (216s)
2019-04-19 08:08:31: 	Pass: testRDDeleteWithMixExceptionAndSuccess (780s)
2019-04-19 08:08:31: Class: RD_RecurringDonations_TEST
2019-04-19 08:08:31: 	Pass: closeOppForOpenEndedRecurringDonationCustomDays (1489s)
2019-04-19 08:08:31: 	Pass: closeOppForOpenEndedRecurringDonationCustomMonths (915s)
2019-04-19 08:08:31: 	Pass: closeOppForOpenEndedRecurringDonationCustomWeeks (1190s)
2019-04-19 08:08:31: 	Pass: closeOppForOpenEndedRecurringDonationCustomYears (774s)
2019-04-19 08:08:31: 	Pass: closeOppForOpenEndedRecurringDonationMonthly (834s)
2019-04-19 08:08:31: 	Pass: closeOppForOpenEndedRecurringDonationQuarterly (922s)
2019-04-19 08:08:31: 	Pass: closeOppForOpenEndedRecurringDonationWeekly (1702s)
2019-04-19 08:08:31: 	Pass: contactRolesOnOppsBucket (540s)
2019-04-19 08:08:31: 	Pass: contactRolesOnOppsHHAccount (682s)
2019-04-19 08:08:31: 	Pass: contactRolesOnOppsOne2One (580s)
2019-04-19 08:08:31: 	Pass: deleteRecurringDonation (959s)
2019-04-19 08:08:31: 	Pass: insertCampaignOpportunities (658s)
2019-04-19 08:08:31: 	Pass: insertOpenEndedRecurringDonations (2883s)
2019-04-19 08:08:31: 	Pass: insertOpportunities (727s)
2019-04-19 08:08:31: 	Pass: insertQuarterlyOpportunities (616s)
2019-04-19 08:08:31: 	Pass: insertWeeklyOpportunities (605s)
2019-04-19 08:08:31: 	Pass: testOppContactRoleMethod (1968s)
2019-04-19 08:08:31: 	Pass: testSettingsCreation (16s)
2019-04-19 08:08:31: 	Pass: updateOpenEndedRecurringDonation1an15 (902s)
2019-04-19 08:08:31: 	Pass: updateOpenEndedRecurringDonationMonthly (2156s)
2019-04-19 08:08:31: 	Pass: updateOpenEndedRecurringDonationQuarterly (1946s)
2019-04-19 08:08:31: 	Pass: updateOpenEndedRecurringDonationWeekly (1814s)
2019-04-19 08:08:31: 	Pass: updateOpenEndedRecurringDonationYearly (1883s)
2019-04-19 08:08:31: Class: RD_RecurringDonations_TEST2
2019-04-19 08:08:31: 	Pass: adjustDayOfMonthReturnsDateBasedOnEstablishedDay (139s)
2019-04-19 08:08:31: 	Pass: adjustDayOfMonthReturnsDateBasedOnNextDonationDay (13s)
2019-04-19 08:08:31: 	Pass: adjustDayOfMonthReturnsDayOfMonthSelected (12s)
2019-04-19 08:08:31: 	Pass: adjustDayOfMonthReturnsEndOfMonthWhenAlwaysEndOfMonthIsSet (13s)
2019-04-19 08:08:31: 	Pass: adjustDayOfMonthReturnsSameDateWhenNextDonationNotEndOfMonth (13s)
2019-04-19 08:08:31: 	Pass: adjustDayOfMonthReturnsSameDateWhenNotEndOfMonthDay (13s)
2019-04-19 08:08:31: 	Pass: batchStatusBarTest (53s)
2019-04-19 08:08:31: 	Pass: closeDateIsCalculatedBasedOnDayOfMonth (59s)
2019-04-19 08:08:31: 	Pass: closeDateIsCalculatedBasedOnDayOfMonthStartDateEndOfMonth (18s)
2019-04-19 08:08:31: 	Pass: closeOpenEndedRecurringDonationMarkOppsClosedLost (2996s)
2019-04-19 08:08:31: 	Pass: closeOppForOpenEndedRecurringDonationBadRecurrance (1001s)
2019-04-19 08:08:31: 	Pass: closeOppForOpenEndedRecurringDonationYearly (860s)
2019-04-19 08:08:31: 	Pass: closeRecurringDonationDeleteOpps (724s)
2019-04-19 08:08:31: 	Pass: errorMessageDisplayedWhenMissingId (27s)
2019-04-19 08:08:31: 	Pass: insertClosedOppForOpenEndedRecurringDonation (805s)
2019-04-19 08:08:31: 	Pass: multipleRDInsert (1051s)
2019-04-19 08:08:31: 	Pass: nextDonationDateIsCalculatedBasedOnDayOfMonthAndCurrentNextDonationDate (12s)
2019-04-19 08:08:31: 	Pass: nextDonationDateIsGreaterOrEqualToDateEstablished (9s)
2019-04-19 08:08:31: 	Pass: shouldUpdateOpenOppCloseDatesWhenRecDonationNextDonationDateIsChanged (1077s)
2019-04-19 08:08:31: 	Pass: testBTN (1122s)
2019-04-19 08:08:31: 	Pass: testBatch (1530s)
2019-04-19 08:08:31: 	Pass: testErrorHandlingAllSysAdmins (1597s)
2019-04-19 08:08:31: 	Pass: testErrorHandlingPublicGroup (1740s)
2019-04-19 08:08:31: 	Pass: testErrorHandlingUser (1591s)
2019-04-19 08:08:31: 	Pass: testInstallmentNumbers (886s)
2019-04-19 08:08:31: 	Pass: testOpenEndedMonthlyEndDates_28th (970s)
2019-04-19 08:08:31: 	Pass: testOpenEndedMonthlyEndDates_30th (994s)
2019-04-19 08:08:31: 	Pass: testOpenEndedMonthlyEndDates_EOM (950s)
2019-04-19 08:08:31: 	Pass: testOrphanedRd (1180s)
2019-04-19 08:08:31: 	Pass: testRDCustomFieldMappingFixedRD (1039s)
2019-04-19 08:08:31: 	Pass: testRDCustomFieldMappingOpenRD (1059s)
2019-04-19 08:08:31: 	Pass: tooManyInstallments (270s)
2019-04-19 08:08:31: 	Pass: updateMultipleOpenEndedRecurringDonationsPaidAmountWithAClosedWonOpp (1143s)
2019-04-19 08:08:31: 	Pass: updateOpenEndedRecurringDonationsPaidAmountByRemovingAClosedWonOpp (936s)
2019-04-19 08:08:31: 	Pass: updateOpenEndedRecurringDonationsPaidAmountWithAClosedWonOpp (1106s)
2019-04-19 08:08:31: 	Pass: updateOppsFromMultipleRDs (1689s)
2019-04-19 08:08:31: 	Pass: updateRecurringDonationWithClosedOpp (3306s)
2019-04-19 08:08:31: Class: REL_Relationships_TEST
2019-04-19 08:08:31: 	Pass: RelationshipsViewer_TEST (1492s)
2019-04-19 08:08:31: 	Pass: test2Rels1Transaction_v2 (980s)
2019-04-19 08:08:31: 	Pass: testAutoCreateCampaignMemberInsert (1383s)
2019-04-19 08:08:31: 	Pass: testAutoCreateCampaignMemberUpdate (831s)
2019-04-19 08:08:31: 	Pass: testAutoCreateContactInsert (1322s)
2019-04-19 08:08:31: 	Pass: testAutoCreateContactUpdate (1346s)
2019-04-19 08:08:31: 	Pass: testAutoCreateDupePrevention (1099s)
2019-04-19 08:08:31: 	Pass: testContactRel (947s)
2019-04-19 08:08:31: 	Pass: testDeletingMutuallyReferentialRelationshipsDoesNotPreventDeleteOfReciprocals (854s)
2019-04-19 08:08:31: 	Pass: testErrorRecordCreation (685s)
2019-04-19 08:08:31: 	Pass: testExceptionRecordCreation (706s)
2019-04-19 08:08:31: 	Pass: testFemaleGenderFieldReciprocal (833s)
2019-04-19 08:08:31: 	Pass: testFemaleSalutationReciprocal (732s)
2019-04-19 08:08:31: 	Pass: testFieldSyncExclusion (723s)
2019-04-19 08:08:31: 	Pass: testGenderChange (1349s)
2019-04-19 08:08:31: 	Pass: testGenderChangeWithMissingReciprocal (1232s)
2019-04-19 08:08:31: 	Pass: testInversionSettingsHaveType (754s)
2019-04-19 08:08:31: 	Pass: testInversionSettingsNoType (753s)
2019-04-19 08:08:31: 	Pass: testMaleGenderFieldReciprocal (816s)
2019-04-19 08:08:31: 	Pass: testMaleSalutationReciprocal (683s)
2019-04-19 08:08:31: 	Pass: testNeutralGenderFieldReciprocal (935s)
2019-04-19 08:08:31: 	Pass: testNeutralSalutationReciprocal (684s)
2019-04-19 08:08:31: 	Pass: testNoGenderManualRel (1036s)
2019-04-19 08:08:31: 	Pass: testNoGenderManualRelStatusChange (1150s)
2019-04-19 08:08:31: 	Pass: testNoValidSettingsConfig (824s)
2019-04-19 08:08:31: 	Pass: testOrphanedRelDelete (1072s)
2019-04-19 08:08:31: 	Pass: testRelationshipDelete (880s)
2019-04-19 08:08:31: 	Pass: testRelationshipUTILS (30s)
2019-04-19 08:08:31: 	Pass: testTypeChangeOnly (852s)
2019-04-19 08:08:31: Class: RLLP_OppPartialSoftCreditRollup_TEST
2019-04-19 08:08:31: 	Pass: testDuplicateOCRSoftCredits (1321s)
2019-04-19 08:08:31: 	Pass: testMulticurrencyPartialSoftCreditRollups (18s)
2019-04-19 08:08:31: 	Pass: testPartialSoftCreditRollups (4500s)
2019-04-19 08:08:31: 	Pass: testPartialSoftCreditRollupsAllStats (1350s)
2019-04-19 08:08:31: 	Pass: test_ContactApplyPartialSoftCredit_AlwaysRollupToPrimaryContactIsFalse (422s)
2019-04-19 08:08:31: 	Pass: test_ContactApplyPartialSoftCredit_AlwaysRollupToPrimaryContactIsTrue (409s)
2019-04-19 08:08:31: 	Pass: test_ContactApplySoftCredit_AlwaysRollupToPrimaryContactIsFalse (374s)
2019-04-19 08:08:31: 	Pass: test_ContactApplySoftCredit_AlwaysRollupToPrimaryContactIsTrue (397s)
2019-04-19 08:08:31: Class: RLLP_OppRollupBATCH_TEST
2019-04-19 08:08:31: 	Pass: testOppAcctRollupBatch (1857s)
2019-04-19 08:08:31: 	Pass: testOppContactRollupBatch (1249s)
2019-04-19 08:08:31: 	Pass: testOppPartialSoftCreditRollupBatch (1520s)
2019-04-19 08:08:31: 	Pass: testOppSoftCreditRollupBatch (1357s)
2019-04-19 08:08:31: Class: RLLP_OppRollup_TEST
2019-04-19 08:08:31: 	Pass: OneContactMultipleOppsHHAccount_1 (2165s)
2019-04-19 08:08:31: 	Pass: OneContactMultipleOppsHHAccount_2 (1541s)
2019-04-19 08:08:31: 	Pass: OneContactMultipleOppsHHAccount_3 (1833s)
2019-04-19 08:08:31: 	Pass: OneContactMultipleOppsHHAccount_4 (1547s)
2019-04-19 08:08:31: 	Pass: OneContactMultipleOppsHHAccount_5 (1239s)
2019-04-19 08:08:31: 	Pass: OneContactMultipleOppsHHAccount_6 (1579s)
2019-04-19 08:08:31: 	Pass: OneContactMultipleOppsOne2One_1 (1443s)
2019-04-19 08:08:31: 	Pass: OneContactMultipleOppsOne2One_2 (1424s)
2019-04-19 08:08:31: 	Pass: OneContactMultipleOppsOne2One_3 (1718s)
2019-04-19 08:08:31: 	Pass: OneContactMultipleOppsOne2One_4 (1451s)
2019-04-19 08:08:31: 	Pass: OneContactMultipleOppsOne2One_5 (1215s)
2019-04-19 08:08:31: 	Pass: OneContactMultipleOppsOne2One_6 (1409s)
2019-04-19 08:08:31: 	Pass: OneContactOneInkindHHAccount (691s)
2019-04-19 08:08:31: 	Pass: OneContactOneInkindOne2One (669s)
2019-04-19 08:08:31: 	Pass: shouldCallCustomizableRollupsWhenEnabledAndAsync (202s)
2019-04-19 08:08:31: 	Pass: shouldEnqueMultipleCustomizableRollupsForMultipleSObjects (292s)
2019-04-19 08:08:31: 	Pass: shouldNotCallCustomizableRollupsWhenDisabledAndAsync (52s)
2019-04-19 08:08:31: 	Pass: testGivingRollupAcctHHAccount (366s)
2019-04-19 08:08:31: 	Pass: testGivingRollupAcctMembershipHHAccount (539s)
2019-04-19 08:08:31: 	Pass: testGivingRollupAcctMembershipOne2One (516s)
2019-04-19 08:08:31: 	Pass: testGivingRollupAcctOne2One (344s)
2019-04-19 08:08:31: 	Pass: testGivingRollupAlwaysPrimaryHHAccount (1016s)
2019-04-19 08:08:31: 	Pass: testGivingRollupAlwaysPrimaryOne2One (957s)
2019-04-19 08:08:31: 	Pass: testGivingRollupBatchHHAccount (5178s)
2019-04-19 08:08:31: 	Pass: testGivingRollupBatchOne2One (4174s)
2019-04-19 08:08:31: 	Pass: testGivingRollupBulkHHAccount (5943s)
2019-04-19 08:08:31: 	Pass: testGivingRollupBulkOne2One (5595s)
2019-04-19 08:08:31: 	Pass: testGivingRollupExcludedRTHHAccount (877s)
2019-04-19 08:08:31: 	Pass: testGivingRollupExcludedRTOne2One (796s)
2019-04-19 08:08:31: 	Pass: testGivingRollupHHAccount (1450s)
2019-04-19 08:08:31: 	Pass: testGivingRollupIndividualBucket (1030s)
2019-04-19 08:08:31: 	Pass: testGivingRollupIndividualHHAccount (1125s)
2019-04-19 08:08:31: 	Pass: testGivingRollupOne2One (960s)
2019-04-19 08:08:31: 	Pass: testMemberRollupHHAccount (1027s)
2019-04-19 08:08:31: 	Pass: testMemberRollupOne2One (1010s)
2019-04-19 08:08:31: Class: RLLP_OppRollup_TEST2
2019-04-19 08:08:31: 	Pass: testFYUtility (41s)
2019-04-19 08:08:31: 	Pass: testFiscalYearandCustomNDayHHAccount (1220s)
2019-04-19 08:08:31: 	Pass: testFiscalYearandCustomNDayOne2One (999s)
2019-04-19 08:08:31: 	Pass: testFutureMethodsHHAccount (2140s)
2019-04-19 08:08:31: 	Pass: testFutureMethodsOne2One (2078s)
2019-04-19 08:08:31: 	Pass: testGetFiscalYearForDate (20s)
2019-04-19 08:08:31: 	Pass: testGivingRollupTooManyOppsHHAccount (9336s)
2019-04-19 08:08:31: 	Pass: testGivingRollupTooManyOppsOne2One (6365s)
2019-04-19 08:08:31: 	Pass: testHouseholdStatsHHAccount (1255s)
2019-04-19 08:08:31: 	Pass: testHouseholdStatsOne2One (1193s)
2019-04-19 08:08:31: 	Pass: testMultiCurrencyMethodsHHAccount (554s)
2019-04-19 08:08:31: 	Pass: testMultiCurrencyMethodsOne2One (1901s)
2019-04-19 08:08:31: 	Pass: testOpportunityUtilityErrorHandlingHHAccount (988s)
2019-04-19 08:08:31: 	Pass: testOpportunityUtilityErrorHandlingOne2One (1036s)
2019-04-19 08:08:31: 	Pass: testOrgSoftCreditsHHAccount (1808s)
2019-04-19 08:08:31: 	Pass: testOrgSoftCreditsOne2One (1357s)
2019-04-19 08:08:31: 	Pass: testRollupAllsHHAccount (106s)
2019-04-19 08:08:31: 	Pass: testRollupAllsOne2One (102s)
2019-04-19 08:08:31: 	Pass: testSoftCreditsHHAccount (2459s)
2019-04-19 08:08:31: 	Pass: testSoftCreditsOne2One (2313s)
2019-04-19 08:08:31: 	Pass: testUDRChangeBehaviorHHAccount (1529s)
2019-04-19 08:08:31: 	Pass: testUDRChangeBehaviorOne2One (1258s)
2019-04-19 08:08:31: 	Pass: testUserDefinedRollupHHAccount (1214s)
2019-04-19 08:08:31: 	Pass: testUserDefinedRollupOne2One (1126s)
2019-04-19 08:08:31: Class: RP_GettingStartedTest
2019-04-19 08:08:31: 	Pass: testGettingStartedLinks (19s)
2019-04-19 08:08:31: Class: RP_GitHubTest
2019-04-19 08:08:31: 	Pass: testFailedRequest (40s)
2019-04-19 08:08:31: 	Pass: testFormatDate (375s)
2019-04-19 08:08:31: 	Pass: testLoadReleaseNotesFromSFORG (16s)
2019-04-19 08:08:31: Class: RP_GitHubTestMock
2019-04-19 08:08:31: Class: RP_YoutubeTest
2019-04-19 08:08:31: 	Pass: testFailedRequest (54s)
2019-04-19 08:08:31: 	Pass: testYoutubeListOfVideos (14s)
2019-04-19 08:08:31: Class: RP_YoutubeTestMock
2019-04-19 08:08:31: Class: STG_InstallScript_TEST
2019-04-19 08:08:31: 	Pass: defaultSettingsCreated (310s)
2019-04-19 08:08:31: 	Pass: deletedHandlers (372s)
2019-04-19 08:08:31: 	Pass: mappingsTest_runScriptCustomConfigOnInstallAllFlags (266s)
2019-04-19 08:08:31: 	Pass: mappingsTest_runScriptCustomConfigOnInstallSomeFlags (199s)
2019-04-19 08:08:31: 	Pass: mappingsTest_runScriptNoCustomConfigOnInstall (202s)
2019-04-19 08:08:31: 	Pass: mappingsTest_runScriptNoCustomSettings (241s)
2019-04-19 08:08:31: 	Pass: missingSettingsCreated (270s)
2019-04-19 08:08:31: 	Pass: push (217s)
2019-04-19 08:08:31: 	Pass: testErrorLoggerCorrectlyBuildsEmailBody (23s)
2019-04-19 08:08:31: 	Pass: testErrorLoggerHasErrorsReturnsFalse (8s)
2019-04-19 08:08:31: 	Pass: testErrorLoggerHasErrorsReturnsTrue (8s)
2019-04-19 08:08:31: 	Pass: testExceptionsAreEmailedAndLogged (779s)
2019-04-19 08:08:31: 	Pass: testInstallActionsAreIndependent (213s)
2019-04-19 08:08:31: 	Pass: testNewInstallSetsRecurringDonationInstallmentNumber (3067s)
2019-04-19 08:08:31: 	Pass: testNoEmailIsSentOrErrorLoggedOnSuccessfulInstall (107s)
2019-04-19 08:08:31: 	Pass: upgrade (168s)
2019-04-19 08:08:31: Class: STG_InstallScript_TEST2
2019-04-19 08:08:31: 	Pass: handlersChanged (98s)
2019-04-19 08:08:31: 	Pass: handlersChanged_UserManaged (50s)
2019-04-19 08:08:31: Class: STG_PanelHealthCheck_TEST
2019-04-19 08:08:31: 	Pass: shouldCreateDefectResultForEachInvalidRecordType (186s)
2019-04-19 08:08:31: 	Pass: shouldCreateErrorDefectResultWhenOppDisableContactRoleAutomationIsChecked (1007s)
2019-04-19 08:08:31: 	Pass: test_VerifyAccountModelRecordType_DefaultRT_In_SettingsHHRT (44s)
2019-04-19 08:08:31: 	Pass: test_VerifyAccountModelRecordType_DefaultRT_In_SettingsOneToOneRT (39s)
2019-04-19 08:08:31: 	Pass: test_VerifyAccountModelRecordType_InvalidIDRT_In_SettingsHHRT (21s)
2019-04-19 08:08:31: 	Pass: test_VerifyAccountModelRecordType_InvalidIDRT_In_SettingsOneToOneRT (20s)
2019-04-19 08:08:31: 	Pass: test_VerifyAccountModelRecordType_InvalidRT_In_SettingsHHRT (37s)
2019-04-19 08:08:31: 	Pass: test_VerifyAccountModelRecordType_InvalidRT_In_SettingsOneToOneRT (37s)
2019-04-19 08:08:31: 	Pass: test_VerifyAccountModelRecordType_NonDefaultRT_In_SettingsHHRT (36s)
2019-04-19 08:08:31: 	Pass: test_VerifyAccountModelRecordType_NonDefaultRT_In_SettingsOneToOneRT (37s)
2019-04-19 08:08:31: 	Pass: verifyLevelFieldsExist (349s)
2019-04-19 08:08:31: 	Pass: verifyLevelSourceFieldNumeric (134s)
2019-04-19 08:08:31: 	Pass: verifyNoMissingOppPaymentsFail (574s)
2019-04-19 08:08:31: 	Pass: verifyNoMissingOppPaymentsSuccess (474s)
2019-04-19 08:08:31: 	Pass: verifyOCRSettingsCheck (62s)
2019-04-19 08:08:31: 	Pass: verifyTriggerHandlers_fail (185s)
2019-04-19 08:08:31: 	Pass: verifyTriggerHandlers_succeed (123s)
2019-04-19 08:08:31: Class: STG_PanelHouseholds_TEST
2019-04-19 08:08:31: 	Pass: testExampleNameIsAnErrorWhenImplementingClassIsInvalid (131s)
2019-04-19 08:08:31: 	Pass: testExampleNameIsExpectedWhenHHNameFormatFieldIsValid (51s)
2019-04-19 08:08:31: 	Pass: testExampleNameThrowsExceptionWhenHHNameFormatFieldIsInvalid (8s)
2019-04-19 08:08:31: 	Pass: testPanelHasPanelId (5s)
2019-04-19 08:08:31: 	Pass: testPanelPageHasErrorWhenAccountModelIsNotAsExpected (20s)
2019-04-19 08:08:31: 	Pass: testPanelPageHasErrorWhenHHNamingSettingsFieldIsInvalid (90s)
2019-04-19 08:08:31: 	Pass: testPanelValidatesHHNamingSettingsWhetherAutomaticHHNamingIsOn (130s)
2019-04-19 08:08:31: 	Pass: testPanelValidatesUserChangesOfHHNamingSettings (42s)
2019-04-19 08:08:31: 	Pass: testSaveSettingsSavesAutomaticHHNaming (35s)
2019-04-19 08:08:31: Class: STG_PanelOpps_TEST
2019-04-19 08:08:31: 	Pass: testGetOpportunityStageSelectOptionsContainsAtLeastEmptySelection (29s)
2019-04-19 08:08:31: Class: STG_SettingsManager_TEST
2019-04-19 08:08:31: 	Pass: TEST_userRollupSettings (175s)
2019-04-19 08:08:31: 	Pass: testDataBoundMultiSelect (29s)
2019-04-19 08:08:31: 	Pass: testPanel (46s)
2019-04-19 08:08:31: 	Pass: testPanelAffl (18s)
2019-04-19 08:08:31: 	Pass: testPanelAllo (40s)
2019-04-19 08:08:31: 	Pass: testPanelBDE (25s)
2019-04-19 08:08:31: 	Pass: testPanelCRLP (1712s)
2019-04-19 08:08:31: 	Pass: testPanelContactRoles (44s)
2019-04-19 08:08:31: 	Pass: testPanelContacts (16s)
2019-04-19 08:08:31: 	Pass: testPanelErrorLog (44s)
2019-04-19 08:08:31: 	Pass: testPanelHealthCheck (1616s)
2019-04-19 08:08:31: 	Pass: testPanelLeads (14s)
2019-04-19 08:08:31: 	Pass: testPanelLvlAssignBatch (22s)
2019-04-19 08:08:31: 	Pass: testPanelMembership (15s)
2019-04-19 08:08:31: 	Pass: testPanelOppBatch (205s)
2019-04-19 08:08:31: 	Pass: testPanelOppNaming (69s)
2019-04-19 08:08:31: 	Pass: testPanelOppRollups (12s)
2019-04-19 08:08:31: 	Pass: testPanelOpps (11s)
2019-04-19 08:08:31: 	Pass: testPanelPanelPrimaryContactRoleMergeBatch (65s)
2019-04-19 08:08:31: 	Pass: testPanelPaymentMapping (159s)
2019-04-19 08:08:31: 	Pass: testPanelRD (140s)
2019-04-19 08:08:31: 	Pass: testPanelRDBatch (58s)
2019-04-19 08:08:31: 	Pass: testPanelRDCustomFieldMapping (251s)
2019-04-19 08:08:31: 	Pass: testPanelRDCustomInstallment (197s)
2019-04-19 08:08:31: 	Pass: testPanelRel (178s)
2019-04-19 08:08:31: 	Pass: testPanelRelAuto (164s)
2019-04-19 08:08:31: 	Pass: testPanelRelReciprocal (182s)
2019-04-19 08:08:31: 	Pass: testPanelRenameHHDoesNotRunBatchWhenHHNamingSettingsIsInvalid (57s)
2019-04-19 08:08:31: 	Pass: testPanelRenameHHRunsBatchWhenAutomaticHHNamingIsOff (80s)
2019-04-19 08:08:31: 	Pass: testPanelRenameHHRunsBatchWhenAutomaticHHNamingIsOn (57s)
2019-04-19 08:08:31: 	Pass: testPanelSchedule (18s)
2019-04-19 08:08:31: 	Pass: testPanelTDTM (170s)
2019-04-19 08:08:31: 	Pass: testPanelUserRollup (199s)
2019-04-19 08:08:31: 	Pass: testRecordTypeSettingsUpdateExceptionIsDisplayed (825s)
2019-04-19 08:08:31: 	Pass: testRequiredJobsAreScheduledWhenNpspSettingsPageLoads (794s)
2019-04-19 08:08:31: 	Pass: testSettingsManager (11s)
2019-04-19 08:08:31: 	Pass: testSettingsService (20s)
2019-04-19 08:08:31: Class: STG_UninstallScript_TEST
2019-04-19 08:08:31: 	Pass: rununinstall (1393s)
2019-04-19 08:08:31: Class: TDTM_Config_API_Test
2019-04-19 08:08:31: 	Pass: test_disable_for_specific_user (311s)
2019-04-19 08:08:31: 	Pass: test_disable_trigger_in_context (654s)
2019-04-19 08:08:31: 	Pass: triggersAreDisabledForCurrentContext (62s)
2019-04-19 08:08:31: Class: TDTM_DMLgt200_TEST
2019-04-19 08:08:31: 	Pass: testAllocationsCreatedForManyOpenEndedRecurringDonations (13033s)
2019-04-19 08:08:31: 	Pass: testBulkOpportunitiesWithCampaignAlloc (7829s)
2019-04-19 08:08:31: 	Pass: test_address_validation (20410s)
2019-04-19 08:08:31: 	Pass: test_addresses (14466s)
2019-04-19 08:08:31: 	Pass: test_contacts_with_affiliations (10712s)
2019-04-19 08:08:31: 	Pass: test_contacts_with_primary_affiliations (9360s)
2019-04-19 08:08:31: 	Pass: test_contacts_with_relationships (11281s)
2019-04-19 08:08:31: 	Pass: test_household_account_naming (14116s)
2019-04-19 08:08:31: 	Pass: test_recurring_donations (6903s)
2019-04-19 08:08:31: Class: TDTM_Runnable_TEST
2019-04-19 08:08:31: 	Pass: groupByTypeShouldGroupSObjectsByType (756s)
2019-04-19 08:08:31: 	Pass: groupByTypeShouldRemoveDuplicateSObjects (708s)
2019-04-19 08:08:31: 	Pass: testAsync (845s)
2019-04-19 08:08:31: Class: TDTM_TriggerScaffolds_TEST
2019-04-19 08:08:31: 	Pass: tdtmCampaign (2052s)
2019-04-19 08:08:31: 	Pass: tdtmLead (247s)
2019-04-19 08:08:31: Class: USER_InActiveUser_TDTM_TEST
2019-04-19 08:08:31: 	Pass: testHandlingDeactivatedSysAdmin (1017s)
2019-04-19 08:08:31: Class: USER_MixedDML_TEST
2019-04-19 08:08:31: 	Pass: testInsertingUserWithTriggerHandlerMixedDML (583s)
2019-04-19 08:08:31: Class: USER_UserService_TEST
2019-04-19 08:08:31: 	Pass: isCustomizeApplicationUserReturnsFalseWhenReadOnlyUserDoesNotHaveCustomizeAppPermissionSet (413s)
2019-04-19 08:08:31: 	Pass: isCustomizeApplicationUserReturnsTrueForSystemAdmin (150s)
2019-04-19 08:08:31: 	Pass: isCustomizeApplicationUserReturnsTrueWhenReadOnlyUserHasCustomizeAppPermissionSet (536s)
2019-04-19 08:08:31: 	Pass: testDeactivatedSysAdminHandling (324s)
2019-04-19 08:08:31: 	Pass: testHandleScheduledJobsSubmittedByInActiveSysAdmin (1302s)
2019-04-19 08:08:31: 	Pass: testIsActiveUser (281s)
2019-04-19 08:08:31: 	Pass: testIsSysAdmin (311s)
2019-04-19 08:08:31: 	Pass: testLEX (11s)
2019-04-19 08:08:31: 	Pass: testLoggingInActiveSysAdminError (37s)
2019-04-19 08:08:31: 	Pass: testNotifyingSysAdminsAboutInActiveSysAdminUser (346s)
2019-04-19 08:08:31: 	Pass: testSendingInActiveSysAdminEmail (99s)
2019-04-19 08:08:31: 	Pass: testSetErrorNotificationToAllSysAdmins (344s)
2019-04-19 08:08:31: Class: UTIL_CurrencyCache_TEST
2019-04-19 08:08:31: 	Pass: test_AdvancedCurrencyConversion (29s)
2019-04-19 08:08:31: 	Pass: test_CurrencyCache_StaticCacheVar (18s)
2019-04-19 08:08:31: Class: UTIL_CurrencyConversion_TEST
2019-04-19 08:08:31: 	Pass: test_CurrencyConversionWithDatedRates (35s)
2019-04-19 08:08:31: Class: UTIL_Currency_TEST
2019-04-19 08:08:31: 	Pass: testGetCurrencySymbolQueriesForCodeIfMultiCurrency (17s)
2019-04-19 08:08:31: 	Pass: testGetCurrencySymbolReturnsDefaultCurrencySymbolIfSingleCurrency (5s)
2019-04-19 08:08:31: 	Pass: testGetDefaultCurrencySymbolReturnsIsoCodeIfUnknownSymbol (6s)
2019-04-19 08:08:31: 	Pass: testGetDefaultCurrencySymbolReturnsKnownSymbol (5s)
2019-04-19 08:08:31: 	Pass: testGetDefaultCurrencyWrapsUserInfoMethod (4s)
2019-04-19 08:08:31: 	Pass: testGetDefaultOrgCurrencyMethod (19s)
2019-04-19 08:08:31: 	Pass: testIsMultiCurrencyOrganizationWrapsUserInfoMethod (5s)
2019-04-19 08:08:31: 	Pass: testSingletonReturnsExistingInstance (5s)
2019-04-19 08:08:31: 	Pass: testSingletonReturnsNewInstanceIfNoExisting (4s)
2019-04-19 08:08:31: Class: UTIL_DMLService_TEST
2019-04-19 08:08:31: 	Pass: testRecordInsertDMLOptions (565s)
2019-04-19 08:08:31: 	Pass: testRecordInsertWithAllOrNone (290s)
2019-04-19 08:08:31: 	Pass: testRecordInsertWithDefaults (280s)
2019-04-19 08:08:31: 	Pass: testRecordUpdateWithAllOrNone (369s)
2019-04-19 08:08:31: 	Pass: testRecordUpdateWithDMLOptions (371s)
2019-04-19 08:08:31: 	Pass: testRecordUpdateWithDefaults (362s)
2019-04-19 08:08:31: 	Pass: testRecordUpsertWithAllOrNone (366s)
2019-04-19 08:08:31: 	Pass: testRecordUpsertWithDefaults (207s)
2019-04-19 08:08:31: 	Pass: testRecordsInsertWithAllOrNoneFalse (400s)
2019-04-19 08:08:31: 	Pass: testRecordsInsertWithAllOrNoneTrue (297s)
2019-04-19 08:08:31: 	Pass: testRecordsInsertWithDMLOptions (380s)
2019-04-19 08:08:31: 	Pass: testRecordsInsertWithDefaults (297s)
2019-04-19 08:08:31: 	Pass: testRecordsUpdateWithAllOrNone (489s)
2019-04-19 08:08:31: 	Pass: testRecordsUpdateWithDMLOptions (492s)
2019-04-19 08:08:31: 	Pass: testRecordsUpdateWithDefaults (430s)
2019-04-19 08:08:31: 	Pass: testRecordsUpsertWithAllOrNone (388s)
2019-04-19 08:08:31: 	Pass: testRecordsUpsertWithDefaults (432s)
2019-04-19 08:08:31: 	Pass: testRespectDuplicateRuleSettingsForAccounts (416s)
2019-04-19 08:08:31: 	Pass: testRespectDuplicateRuleSettingsForContacts (826s)
2019-04-19 08:08:31: Class: UTIL_Describe_TEST
2019-04-19 08:08:31: 	Pass: testDescribe (367s)
2019-04-19 08:08:31: Class: UTIL_FeatureManagement_TEST
2019-04-19 08:08:31: 	Pass: callsSetPackageBooleanValue (52s)
2019-04-19 08:08:31: 	Pass: callsSetPackageIntegerValue (40s)
2019-04-19 08:08:31: Class: UTIL_Finder_TEST
2019-04-19 08:08:31: 	Pass: executeSearchAppliesPostSortingWhenOrderByFieldIsNotSortable (15s)
2019-04-19 08:08:31: 	Pass: executeSearchDoesNotApplyPostSortingsWhenOrderByFieldIsSortable (13s)
2019-04-19 08:08:31: 	Pass: executeSearchReturnsLimitNumberOfRecords (13s)
2019-04-19 08:08:31: 	Pass: executeSearchWhenSearchQueryContainsSpecialCharacters (803s)
2019-04-19 08:08:31: 	Pass: findQueryIntegrationTest (641s)
2019-04-19 08:08:31: 	Pass: findQueryIntegrationTestWithPostSorting (664s)
2019-04-19 08:08:31: 	Pass: findReturnsMinLimitAndRecordSizeRecords (10s)
2019-04-19 08:08:31: 	Pass: findReturnsUniqueFieldsInSoql (18s)
2019-04-19 08:08:31: 	Pass: findReturnsUniqueFieldsInSosl (29s)
2019-04-19 08:08:31: 	Pass: findSucceedsWhenCompleteQueryReturnsEmptyList (11s)
2019-04-19 08:08:31: 	Pass: findSucceedsWhenCriteriaAndOrderByClausesAreEmpty (11s)
2019-04-19 08:08:31: 	Pass: findSucceedsWhenPostFilteringIsAppliedOnOnTheInSetSearch (649s)
2019-04-19 08:08:31: 	Pass: findSucceedsWhenQueryReturnsEmptyList (10s)
2019-04-19 08:08:31: 	Pass: findSucceedsWhenQueryReturnsEmptyListForPostSorting (11s)
2019-04-19 08:08:31: 	Pass: findSucceedsWhenSearchQueryContainsSpecialCharacters (637s)
2019-04-19 08:08:31: 	Pass: findSucceedsWhenSearchReturnsEmptyList (10s)
2019-04-19 08:08:31: 	Pass: findSucceedsWhenSearchReturnsLimitNumberOfRecords (12s)
2019-04-19 08:08:31: 	Pass: findSucceedsWhenSearchReturnsRecordsForPostFiltering (12s)
2019-04-19 08:08:31: 	Pass: findSucceedsWhenSearchReturnsRecordsForPostFilteringAndSorting (14s)
2019-04-19 08:08:31: 	Pass: findSucceedsWhenSearchingForValuesInTheSet (649s)
2019-04-19 08:08:31: 	Pass: searchBuildReturnsSoslWhenOrderByIsNotProvided (25s)
2019-04-19 08:08:31: 	Pass: searchBuildReturnsSoslWithAllElements (25s)
2019-04-19 08:08:31: 	Pass: searchBuildReturnsSoslWithLogicOperatorsInTheFind (20s)
2019-04-19 08:08:31: 	Pass: searchBuildThrowsAnExceptionWhenFieldsAreNotProvided (9s)
2019-04-19 08:08:31: 	Pass: searchBuildThrowsAnExceptionWhenSObjectTypeIsNotProvided (8s)
2019-04-19 08:08:31: 	Pass: searchBuildThrowsAnExceptionWhenSearchCriteriaIsNotProvided (10s)
2019-04-19 08:08:31: Class: UTIL_HtmlOutput_TEST
2019-04-19 08:08:31: 	Pass: shouldReturnEscapedTag (44s)
2019-04-19 08:08:31: 	Pass: shouldReturnEscapedUrl (8s)
2019-04-19 08:08:31: 	Pass: shouldReturnOriginalTag (10s)
2019-04-19 08:08:31: 	Pass: shouldReturnOriginalTagWithSpace (10s)
2019-04-19 08:08:31: 	Pass: shouldReturnOriginalUrl (11s)
2019-04-19 08:08:31: 	Pass: shouldReturnOriginalUrlWithSpace (11s)
2019-04-19 08:08:31: Class: UTIL_JobProgress_CTRL_TEST
2019-04-19 08:08:31: 	Pass: checkNullBatchJobProgressBehavior (118s)
2019-04-19 08:08:31: 	Pass: jobProgressController (469s)
2019-04-19 08:08:31: Class: UTIL_Namespace_TEST
2019-04-19 08:08:31: 	Pass: TestNamespacePrefixFixups (11s)
2019-04-19 08:08:31: 	Pass: keepUnusedPackagedLabelsInPackage (7s)
2019-04-19 08:08:31: 	Pass: shouldRemoveClassNamespace (5s)
2019-04-19 08:08:31: 	Pass: shouldReturnClassNameWhenNoNamespacePresent (6s)
2019-04-19 08:08:31: 	Pass: testSandboxEmailToRealEmail (6s)
2019-04-19 08:08:31: Class: UTIL_OrderBy_TEST
2019-04-19 08:08:31: 	Pass: buildCreatesEmptyOrderByClauseWhenFieldsAreNotProvided (28s)
2019-04-19 08:08:31: 	Pass: buildReturnsEmptyOrderByClauseWhenAFieldIsNotSortable (8s)
2019-04-19 08:08:31: 	Pass: buildReturnsOrderByClauseWhenAllFieldsAreSortable (11s)
2019-04-19 08:08:31: 	Pass: compareToIsCaseInsensitive (9s)
2019-04-19 08:08:31: 	Pass: compareToReturnsNegativeNumberForDescOrder (9s)
2019-04-19 08:08:31: 	Pass: compareToReturnsNegativeNumberWhenOtherIsNullAscOrderNullsLast (10s)
2019-04-19 08:08:31: 	Pass: compareToReturnsNegativeNumberWhenOtherIsNullDescOrderNullsLast (10s)
2019-04-19 08:08:31: 	Pass: compareToReturnsNegativeNumberWhenValueIsNullAscOrderNullsFirst (11s)
2019-04-19 08:08:31: 	Pass: compareToReturnsNegativeNumberWhenValuePreceedsOther (11s)
2019-04-19 08:08:31: 	Pass: compareToReturnsPositiveNumberForDescOrder (11s)
2019-04-19 08:08:31: 	Pass: compareToReturnsPositiveNumberWhenOtherIsNullDescOrderNullsFirst (11s)
2019-04-19 08:08:31: 	Pass: compareToReturnsPositiveNumberWhenValueFollowsOther (11s)
2019-04-19 08:08:31: 	Pass: compareToReturnsPositiveNumberWhenValueIsNullAscOrderNullsLast (9s)
2019-04-19 08:08:31: 	Pass: compareToReturnsPostiveNumberWhenOtherIsNullAscOrderNullsFirst (10s)
2019-04-19 08:08:31: 	Pass: compareToReturnsZeroWhenValuesAreTheSame (9s)
2019-04-19 08:08:31: 	Pass: getFieldNameReturnsName (8s)
2019-04-19 08:08:31: 	Pass: getFieldNameReturnsNameForTheRelationshipField (10s)
2019-04-19 08:08:31: 	Pass: getValueReturnsSObjectFieldValue (23s)
2019-04-19 08:08:31: 	Pass: isSortDescReturnsFalseForAscSortOrder (9s)
2019-04-19 08:08:31: 	Pass: isSortDescReturnsTrueForDescSortOrder (9s)
2019-04-19 08:08:31: 	Pass: sortOrdersRecordsManuallyWhenFieldsAreNotSortable (11s)
2019-04-19 08:08:31: 	Pass: sortOrdersRecordsManuallyWhenTheFieldIsNotSortable (11s)
2019-04-19 08:08:31: 	Pass: sortOrdersRecordsManuallyWhenTheValueIsNullForNullsFirst (11s)
2019-04-19 08:08:31: 	Pass: sortOrdersRecordsManuallyWhenTheValueIsNullForNullsLast (11s)
2019-04-19 08:08:31: 	Pass: sortOrdersRecordsOrderAscByDefault (400s)
2019-04-19 08:08:31: 	Pass: sortOrdersRecordsOrderDesc (226s)
2019-04-19 08:08:31: 	Pass: sortOrdersRecordsTheSameAsSoqlWithMultipleFields (48607s)
2019-04-19 08:08:31: 	Pass: sortOrdersRecordsTheSameAsSoqlWithRelationshipFields (351s)
2019-04-19 08:08:31: 	Pass: toStringReturnsOrderByForAField (8s)
2019-04-19 08:08:31: 	Pass: toStringReturnsOrderByForFieldAndAscSortOrder (7s)
2019-04-19 08:08:31: 	Pass: toStringReturnsOrderByForFieldAndDescSortOrder (7s)
2019-04-19 08:08:31: 	Pass: toStringReturnsOrderByForFieldAndSortOrderAndNullOrderFirst (8s)
2019-04-19 08:08:31: 	Pass: toStringReturnsOrderByForFieldAndSortOrderAndNullOrderLast (8s)
2019-04-19 08:08:31: 	Pass: toStringReturnsOrderByForRelationshipField (9s)
2019-04-19 08:08:31: Class: UTIL_OrgTelemetry_Batch_TEST
2019-04-19 08:08:31: 	Pass: validateTelemetryBatchJob (237s)
2019-04-19 08:08:31: Class: UTIL_OrgTelemetry_SObject_BATCH_TEST
2019-04-19 08:08:31: 	Pass: opportunitiesJobModeShouldReturnCorrectQueryWhenThereIsALastProcessedId (113s)
2019-04-19 08:08:31: 	Pass: opportunitiesJobModeShouldReturnCorrectQueryWhenThereIsNoLastProcessedId (62s)
2019-04-19 08:08:31: 	Pass: recurringDonationsJobModeShouldReturnCorrectQueryWhenThereIsALastProcessedId (64s)
2019-04-19 08:08:31: 	Pass: recurringDonationsJobModeShouldReturnCorrectQueryWhenThereIsNoLastProcessedId (60s)
2019-04-19 08:08:31: 	Pass: shouldCalculateCorrectRecurringDonationMetrics (57s)
2019-04-19 08:08:31: 	Pass: shouldCalculateCorrectRecurringDonationOppMetrics (46s)
2019-04-19 08:08:31: 	Pass: shouldCaptureRecurringDonationMetricsInFeatureManagement (29s)
2019-04-19 08:08:31: 	Pass: shouldCaptureRecurringDonationOppMetricsInFeatureManagement (9s)
2019-04-19 08:08:31: 	Pass: shouldChainNextBatchOffsetByLastRecordProcessed (199s)
2019-04-19 08:08:31: 	Pass: shouldNotChainNextBatchIfLastProcessedIdIsNull (13s)
2019-04-19 08:08:31: 	Pass: shouldNotChainNextBatchIfThereAreNoMoreRecordsToProcess (30s)
2019-04-19 08:08:31: 	Pass: testSObjectBatchJob (206s)
2019-04-19 08:08:31: Class: UTIL_OrgTelemetry_TEST
2019-04-19 08:08:31: 	Pass: shouldCalculateMinutesBetweenTwoDateTimes (11s)
2019-04-19 08:08:31: 	Pass: validateCountOfErrorLogTelemetry (50s)
2019-04-19 08:08:31: 	Pass: validateCountOfRDOppsTelemetry (14s)
2019-04-19 08:08:31: 	Pass: validateCountOfRecurringDonationsTelemetry (13s)
2019-04-19 08:08:31: 	Pass: validateMaxNumRelatedOppsTelemetry (103s)
2019-04-19 08:08:31: 	Pass: validateNPSPSettingsTelemetry (23s)
2019-04-19 08:08:31: 	Pass: validateOrgEnvironmentTelemetry (44s)
2019-04-19 08:08:31: Class: UTIL_PerfLogger_TEST
2019-04-19 08:08:31: 	Pass: testPerfLoggerMultipleCallsSameLabel (2084s)
2019-04-19 08:08:31: 	Pass: testPerfLoggerSaving (2033s)
2019-04-19 08:08:31: 	Pass: testPerfLoggerTiming (2033s)
2019-04-19 08:08:31: Class: UTIL_Permissions_TEST
2019-04-19 08:08:31: 	Pass: readOnlyUserCannotReadCustomFieldException (332s)
2019-04-19 08:08:31: 	Pass: readOnlyUserCannotReadCustomObjectException (153s)
2019-04-19 08:08:31: 	Pass: readOnlyUserCannotUpdateStandardFieldException (154s)
2019-04-19 08:08:31: 	Pass: readOnlyUserCannotUpdateStandardObjectException (168s)
2019-04-19 08:08:31: 	Pass: readOnlyUserFieldCheckNoException (160s)
2019-04-19 08:08:31: 	Pass: readOnlyUserObjectCheckNoException (157s)
2019-04-19 08:08:31: 	Pass: shouldReturnFalseForReadOnlyUserOnCustomObjectAndFields (155s)
2019-04-19 08:08:31: 	Pass: shouldReturnTrueForAdminUserOnCustomObjectAndFields (160s)
2019-04-19 08:08:31: 	Pass: sysAdminCanDeleteCustomObjectException (161s)
2019-04-19 08:08:31: 	Pass: sysAdminCanUpdateCustomFieldException (160s)
2019-04-19 08:08:31: 	Pass: sysAdminFieldCheckNoException (172s)
2019-04-19 08:08:31: 	Pass: sysAdminObjectCheckNoException (205s)
2019-04-19 08:08:31: Class: UTIL_Profile_TEST
2019-04-19 08:08:31: 	Pass: testGetInstanceQueriesOnceOnMultipleCalls (19s)
2019-04-19 08:08:31: 	Pass: testGetProfileIdsWithInvalidProfileName (13s)
2019-04-19 08:08:31: 	Pass: testGetProfileIdsWithValidProfileName (26s)
2019-04-19 08:08:31: Class: UTIL_Query_TEST
2019-04-19 08:08:31: 	Pass: testSoqlBuildFailsWhenFromValueIsNotProvided (32s)
2019-04-19 08:08:31: 	Pass: testSoqlBuildFailsWhenNoSelectFieldIsProvided (6s)
2019-04-19 08:08:31: 	Pass: testSoqlBuildFailsWhenSelectFieldIsEmpty (11s)
2019-04-19 08:08:31: 	Pass: testSoqlBuildSucceedsWhenWhereClauseIsEmpty (10s)
2019-04-19 08:08:31: 	Pass: testSoqlDoesNotContainDuplicateSelectFields (9s)
2019-04-19 08:08:31: 	Pass: testSoqlExcludesToLabelSalutationWhenSettingsIsOff (10s)
2019-04-19 08:08:31: 	Pass: testSoqlIncludesToLabelSalutationWhenSettingsIsOn (11s)
2019-04-19 08:08:31: 	Pass: testSoqlIsCorrectWhenFromSObjectTypeIsProvided (12s)
2019-04-19 08:08:31: 	Pass: testSoqlIsCorrectWhenLimitClauseIsProvided (1636s)
2019-04-19 08:08:31: 	Pass: testSoqlIsCorrectWhenMultipleWhereClausesAreProvided (230s)
2019-04-19 08:08:31: 	Pass: testSoqlIsCorrectWhenOptionalClausesAreNotProvided (9s)
2019-04-19 08:08:31: 	Pass: testSoqlIsCorrectWhenOrderByClauseIsProvided (194s)
2019-04-19 08:08:31: 	Pass: testSoqlIsCorrectWhenWhereClauseIsProvided (185s)
2019-04-19 08:08:31: Class: UTIL_RecordTypeSettingsUpdate_TEST
2019-04-19 08:08:31: 	Pass: testBlankSettingsRemainBlank (22s)
2019-04-19 08:08:31: 	Pass: testEmptyValuesAreDiscarded (7s)
2019-04-19 08:08:31: 	Pass: testIdsRemainIds (7s)
2019-04-19 08:08:31: 	Pass: testKitchenSink (8s)
2019-04-19 08:08:31: 	Pass: testKnownRecordTypeNamesAreConverted (7s)
2019-04-19 08:08:31: 	Pass: testNullSettingsRemainNull (7s)
2019-04-19 08:08:31: 	Pass: testRecordTypeNameIsCaseInsensitive (5s)
2019-04-19 08:08:31: 	Pass: testRecordTypeNamesAreCaseInsensitive (5s)
2019-04-19 08:08:31: 	Pass: testUnknownRecordTypeNamesAreDiscarded (8s)
2019-04-19 08:08:31: 	Pass: testUpdateDoesNotRunOnUpgradeFrom379 (169s)
2019-04-19 08:08:31: 	Pass: testUpdateDoesNotRunOnUpgradeFrom399 (85s)
2019-04-19 08:08:31: 	Pass: testUpdateRunsOnNewInstall (198s)
2019-04-19 08:08:31: 	Pass: testUpdateRunsOnUpgradeFrom354 (410s)
2019-04-19 08:08:31: 	Pass: testUpdateRunsOnUpgradeFrom377 (104s)
2019-04-19 08:08:31: 	Pass: testUpdateSettings (252s)
2019-04-19 08:08:31: 	Pass: testValidRecordTypeNamesAreDiscardedIfOneRecordTypeNameIsExpected (7s)
2019-04-19 08:08:31: Class: UTIL_RecordTypes_TEST
2019-04-19 08:08:31: 	Pass: testLightningRecordTypes (322s)
2019-04-19 08:08:31: 	Pass: testRecTypes (118s)
2019-04-19 08:08:31: 	Pass: testVFRecordTypes (11s)
2019-04-19 08:08:31: Class: UTIL_String_TEST
2019-04-19 08:08:31: 	Pass: nonAsciiAlphabeticCharactersShouldBeRemoved (26s)
2019-04-19 08:08:31: 	Pass: nonAsciiAlphanuericCharactersShouldBeRemoved (5s)
2019-04-19 08:08:31: 	Pass: nonNumericCharactersShouldBeRemoved (9s)
2019-04-19 08:08:31: 	Pass: nullStringsShouldReturnNull (8s)
2019-04-19 08:08:31: Class: UTIL_Typeahead_TEST
2019-04-19 08:08:31: 	Pass: testQuery (503s)
2019-04-19 08:08:31: Class: UTIL_UnitTestData_TEST
2019-04-19 08:08:31: 	Pass: testCreateNewInactiveUserForTests (638s)
2019-04-19 08:08:31: 	Pass: testCreateNewUserWithDefaultRole (207s)
2019-04-19 08:08:31: 	Pass: testCreateNewUserWithRandomRole (256s)
2019-04-19 08:08:31: Class: UTIL_Where_TEST
2019-04-19 08:08:31: 	Pass: fieldExpEqualsSetsCorrectOperatorAndValue (43s)
2019-04-19 08:08:31: 	Pass: fieldExpGetSearchValueEscapesSingleQuotes (6s)
2019-04-19 08:08:31: 	Pass: fieldExpGetSearchValueReturnsEmptyStringWhenValueIsNull (9s)
2019-04-19 08:08:31: 	Pass: fieldExpGetSearchValueReturnsValue (8s)
2019-04-19 08:08:31: 	Pass: fieldExpGetSearchValueThrowsExceptionWhenOperatorIsNotEquals (10s)
2019-04-19 08:08:31: 	Pass: fieldExpInSetGetSearchValueExcludesNullsAndEmptyStrings (10s)
2019-04-19 08:08:31: 	Pass: fieldExpInSetGetSearchValueReturnsIdValues (8s)
2019-04-19 08:08:31: 	Pass: fieldExpInSetGetSearchValueReturnsValueWhenSetHasOneElement (9s)
2019-04-19 08:08:31: 	Pass: fieldExpInSetGetSearchValueReturnsValuesConnectedWithOR (9s)
2019-04-19 08:08:31: 	Pass: fieldExpInSetGetSearchValueThrowsExceptionWhenSetIsEmpty (9s)
2019-04-19 08:08:31: 	Pass: fieldExpInSetSetsCorrectOperatorAndValue (10s)
2019-04-19 08:08:31: 	Pass: fieldExpInSetToStringIncludesNullsAndEmptyStrings (9s)
2019-04-19 08:08:31: 	Pass: fieldExpInSetToStringReturnsCommaSeparatedElementsInQuotes (9s)
2019-04-19 08:08:31: 	Pass: fieldExpInSetToStringReturnsIdValues (10s)
2019-04-19 08:08:31: 	Pass: fieldExpInSetToStringReturnsValueWhenSetHasOneElement (9s)
2019-04-19 08:08:31: 	Pass: fieldExpInSetToStringThrowsExceptionWhenSetIsEmpty (10s)
2019-04-19 08:08:31: 	Pass: fieldExpMeetsCriteriaShouldReturnTrueWhenMatchingOnNull (9s)
2019-04-19 08:08:31: 	Pass: fieldExpMeetsCriteriaShouldReturnTrueWhenOperatorIsNotEqualsAndValueIsTheSame (9s)
2019-04-19 08:08:31: 	Pass: fieldExpMeetsCriteriaShouldReturnTrueWhenReferenceFieldValueIsMatched (12s)
2019-04-19 08:08:31: 	Pass: fieldExpMeetsCriteriaShouldReturnTrueWhenValueIsMatched (9s)
2019-04-19 08:08:31: 	Pass: fieldExpNotEqualsSetsCorrectOperatorAndValue (9s)
2019-04-19 08:08:31: 	Pass: fieldExpToStringEscapesSingleQuotes (8s)
2019-04-19 08:08:31: 	Pass: fieldExpToStringReturnsExpressionOnId (8s)
2019-04-19 08:08:31: 	Pass: fieldExpToStringReturnsExpressionOnNullValueWhenValueIsEmptyString (11s)
2019-04-19 08:08:31: 	Pass: fieldExpToStringReturnsExpressionOnNullValueWhenValueIsNull (8s)
2019-04-19 08:08:31: 	Pass: groupExpGetSearchValueReturnsEmptyStringWhenNoFieldExpIsProvided (8s)
2019-04-19 08:08:31: 	Pass: groupExpGetSearchValueReturnsFieldExpsConnectedWithANDByDefault (9s)
2019-04-19 08:08:31: 	Pass: groupExpGetSearchValueReturnsFieldExpsConnectedWithOR (9s)
2019-04-19 08:08:31: 	Pass: groupExpIsFilterableReturnsFalseWhenAtLeastOneFieldExpIsNotFilterable (11s)
2019-04-19 08:08:31: 	Pass: groupExpIsFilterableReturnsTrueWhenAllFieldExpsAreFilterable (9s)
2019-04-19 08:08:31: 	Pass: groupExpMeetsCriteriaShouldReturnTrueWhenAllValuesAreMatchedForANDOper (12s)
2019-04-19 08:08:31: 	Pass: groupExpMeetsCriteriaShouldReturnTrueWhenEitherValueMatchForOROper (11s)
2019-04-19 08:08:31: 	Pass: groupExpToStringDoesNotUseBracketsWhenHavingOneFieldExp (10s)
2019-04-19 08:08:31: 	Pass: groupExpToStringReturnsEmptyStringWhenNoFieldExpIsProvided (8s)
2019-04-19 08:08:31: 	Pass: groupExpToStringReturnsFieldExpsConnectedWithANDByDefault (9s)
2019-04-19 08:08:31: 	Pass: groupExpToStringReturnsFieldExpsConnectedWithOR (10s)
2019-04-19 08:08:31: 	Pass: whereBuildReturnsSoqlWhenAllGroupExpsAreFilterable (16s)
2019-04-19 08:08:32: 	Pass: whereBuildUsesOROperatorWhenItIsSet (9s)
2019-04-19 08:08:32: 	Pass: whereGetFieldsReturnsAllFieldNames (11s)
2019-04-19 08:08:32: 	Pass: whereIsFilterableReturnsFalseWhenAtLeastOneGroupExpIsNotFilterable (319s)
2019-04-19 08:08:32: 	Pass: whereIsFilterableReturnsTrueWhenAllGroupExpsAreFilterable (12s)
2019-04-19 08:08:32: 	Pass: whereIsFilterableReturnsTrueWhenWhereClauseIsEmpty (9s)
2019-04-19 08:08:32: 	Pass: whereMeetsCriteriaShouldReturnTrueWhenAllValuesAreMatchedForANDOper (12s)
2019-04-19 08:08:32: 	Pass: whereMeetsCriteriaShouldReturnTrueWhenAllValuesAreMatchedForOROper (17s)
2019-04-19 08:08:32: 	Pass: whereMeetsCriteriaShouldReturnTrueWhenItHasNoGroupExpression (11s)
2019-04-19 08:08:32: --------------------------------------------------------------------------------
2019-04-19 08:08:32: Pass: 1533  Fail: 2  CompileFail: 0  Skip: 0
2019-04-19 08:08:32: --------------------------------------------------------------------------------
2019-04-19 08:08:32: --------------------------------------------------------------------------------
2019-04-19 08:08:32: Failing Tests
2019-04-19 08:08:32: --------------------------------------------------------------------------------
2019-04-19 08:08:32: 1: CMT_MetadataAPI_TEST.test_cmt_api - Fail
2019-04-19 08:08:32: 	Message: System.NullPointerException: Attempt to de-reference a null object
2019-04-19 08:08:32: 	StackTrace: Class.npsp.CMT_MetadataAPI.MetadataCallBack.handleResult: line 179, column 1
Class.npsp.CMT_MetadataAPI_TEST.test_cmt_api: line 59, column 1
2019-04-19 08:08:32: 2: CRLP_ConfigBuilder_TEST.test_CMTdeployment - Fail
2019-04-19 08:08:32: 	Message: System.NullPointerException: Attempt to de-reference a null object
2019-04-19 08:08:32: 	StackTrace: Class.npsp.CMT_MetadataAPI.MetadataCallBack.handleResult: line 179, column 1
Class.npsp.CRLP_ConfigBuilder_TEST.test_CMTdeployment: line 105, column 1
2019-04-19 08:08:32: Logging error to sentry.io
2019-04-19 08:08:32: Exception in task run_tests
Traceback (most recent call last):
  File "/app/.heroku/python/lib/python3.7/site-packages/cumulusci/core/flowrunner.py", line 210, in run_step
    task()
  File "/app/.heroku/python/lib/python3.7/site-packages/cumulusci/core/tasks.py", line 141, in __call__
    self.result = self._run_task()
  File "/app/.heroku/python/lib/python3.7/site-packages/cumulusci/tasks/apex/testrunner.py", line 330, in _run_task
    self.counts.get("Fail"), self.counts.get("CompileFail")
cumulusci.core.exceptions.ApexTestException: 2 tests failed and 0 tests failed compilation