ci_feature_beta_deps

2019-04-19 07:24:28: ============================================================
2019-04-19 07:24:28: Initializing flow: FlowCoordinator (ci_feature_beta_deps)
2019-04-19 07:24:28: Install the latest beta version of dependencies and run apex tests.
2019-04-19 07:24:28: ============================================================
2019-04-19 07:24:28: 
2019-04-19 07:24:28: Verifying and refreshing credentials for the specified org: feature.
2019-04-19 07:24:28: ------------------------------------------------------------
2019-04-19 07:24:28: Organization:
2019-04-19 07:24:28:   Username: test-ahse0xh81mk4@example.com
2019-04-19 07:24:28:     Org Id: 00D1D000000D41h
2019-04-19 07:24:28: ------------------------------------------------------------
2019-04-19 07:24:28: 
2019-04-19 07:24:28: ------------------------------------------------------------
2019-04-19 07:24:28: Steps:
2019-04-19 07:24:28: 1.1: beta_dependencies.update_dependencies: Installs all dependencies in project__dependencies into the target org
2019-04-19 07:24:28: 1.2: beta_dependencies.deploy_pre: Deploys all metadata bundles under unpackaged/pre/
2019-04-19 07:24:28: 2.1: deploy_unmanaged.unschedule_apex: Unschedule all scheduled apex jobs (CronTriggers).
2019-04-19 07:24:28: 2.2: deploy_unmanaged.update_package_xml: Updates src/package.xml with metadata in src/
2019-04-19 07:24:28: 2.3: deploy_unmanaged.deploy: Deploys the src directory of the repository to the org
2019-04-19 07:24:28: 2.4: deploy_unmanaged.uninstall_packaged_incremental: Deletes any metadata from the package in the target org not in the local workspace
2019-04-19 07:24:28: 3.1: config_apextest.deploy_post: Deploys all metadata bundles under unpackaged/post/
2019-04-19 07:24:28: 3.2: config_apextest.update_admin_profile: Retrieves, edits, and redeploys the Admin.profile with full FLS perms for all objects/fields
2019-04-19 07:24:28: 4: run_tests: Runs all apex tests
2019-04-19 07:24:28: 5: github_parent_to_children: Merges the latest commit on a parent feature branch into all child feature branches
2019-04-19 07:24:28: ------------------------------------------------------------
2019-04-19 07:24:28: 
2019-04-19 07:24:28: Starting execution
2019-04-19 07:24:28: ============================================================
2019-04-19 07:24:28: 
2019-04-19 07:24:28: ------------------------------------------------------------
2019-04-19 07:24:28: Running task: update_dependencies
2019-04-19 07:24:28: ------------------------------------------------------------
2019-04-19 07:24:28: 
2019-04-19 07:24:28: Options:
2019-04-19 07:24:28:   dependencies: [OrderedDict([('github', 'https://github.com/SalesforceFoundation/Households')]), OrderedDict([('github', 'https://github.com/SalesforceFoundation/Recurring_Donations')]), OrderedDict([('github', 'https://github.com/SalesforceFoundation/Relationships')]), OrderedDict([('github', 'https://github.com/SalesforceFoundation/Affiliations')])]
2019-04-19 07:24:28:   namespaced_org: False
2019-04-19 07:24:28:   purge_on_delete: True
2019-04-19 07:24:28:   include_beta: True
2019-04-19 07:24:28: Beginning task: UpdateDependencies
2019-04-19 07:24:28: 
2019-04-19 07:24:28: Preparing static dependencies map
2019-04-19 07:24:28: Processing dependencies from Github repo https://github.com/SalesforceFoundation/Households
2019-04-19 07:24:28: Processing dependencies from Github repo https://github.com/SalesforceFoundation/Contacts_and_Organizations
2019-04-19 07:24:29: Processing dependencies from Github repo https://github.com/SalesforceFoundation/Recurring_Donations
2019-04-19 07:24:30: Processing dependencies from Github repo https://github.com/SalesforceFoundation/Relationships
2019-04-19 07:24:31: Processing dependencies from Github repo https://github.com/SalesforceFoundation/Affiliations
2019-04-19 07:24:32: Dependencies:
2019-04-19 07:24:32:   - dependencies: 
    
2019-04-19 07:24:32:       - name: Install Contacts & Organizations 3.12 (Beta 2)
2019-04-19 07:24:32:         namespace: npe01
2019-04-19 07:24:32:         version: 3.12 (Beta 2)
2019-04-19 07:24:32:     name: Install Households 3.12 (Beta 1)
2019-04-19 07:24:32:     namespace: npo02
2019-04-19 07:24:32:     version: 3.12 (Beta 1)
2019-04-19 07:24:32:   - name: Install Recurring Donations 3.13
2019-04-19 07:24:32:     namespace: npe03
2019-04-19 07:24:32:     version: 3.13
2019-04-19 07:24:32:   - name: Install Relationships 3.8
2019-04-19 07:24:32:     namespace: npe4
2019-04-19 07:24:32:     version: 3.8
2019-04-19 07:24:32:   - name: Install Affiliations 3.8 (Beta 25)
2019-04-19 07:24:32:     namespace: npe5
2019-04-19 07:24:32:     version: 3.8 (Beta 25)
2019-04-19 07:24:32: Retrieving list of packages from target org
2019-04-19 07:24:32: Pending
2019-04-19 07:24:33: [Pending]: next check in 1 seconds
2019-04-19 07:24:34: [Done]
2019-04-19 07:24:35:   npe01: Install version 3.12 (Beta 2)
2019-04-19 07:24:35:   npo02: Install version 3.12 (Beta 1)
2019-04-19 07:24:35:   npe03: Install version 3.13
2019-04-19 07:24:35:   npe4: Install version 3.8
2019-04-19 07:24:35:   npe5: Install version 3.8 (Beta 25)
2019-04-19 07:24:35: Installing npe01 version 3.12 (Beta 2)
2019-04-19 07:24:35: Pending
2019-04-19 07:24:36: [Pending]: next check in 1 seconds
2019-04-19 07:24:37: [Pending]: next check in 1 seconds
2019-04-19 07:24:38: [Pending]: next check in 2 seconds
2019-04-19 07:24:40: [Pending]: next check in 2 seconds
2019-04-19 07:24:42: [Pending]: next check in 2 seconds
2019-04-19 07:24:45: [Pending]: next check in 3 seconds
2019-04-19 07:24:48: [Pending]: next check in 3 seconds
2019-04-19 07:24:51: [Pending]: next check in 3 seconds
2019-04-19 07:24:54: [Pending]: next check in 4 seconds
2019-04-19 07:24:59: [InProgress]: Processing Type: InstalledPackage
2019-04-19 07:25:00: [InProgress]: Processing Type: InstalledPackage
2019-04-19 07:25:01: [InProgress]: Processing Type: InstalledPackage
2019-04-19 07:25:02: [InProgress]: Processing Type: InstalledPackage
2019-04-19 07:25:04: [InProgress]: Processing Type: InstalledPackage
2019-04-19 07:25:05: [InProgress]: Processing Type: InstalledPackage
2019-04-19 07:25:06: [InProgress]: Processing Type: InstalledPackage
2019-04-19 07:25:07: [InProgress]: Processing Type: InstalledPackage
2019-04-19 07:25:09: [InProgress]: Processing Type: InstalledPackage
2019-04-19 07:25:10: [InProgress]: Processing Type: InstalledPackage
2019-04-19 07:25:11: [InProgress]: Processing Type: InstalledPackage
2019-04-19 07:25:12: [InProgress]: Processing Type: InstalledPackage
2019-04-19 07:25:13: [InProgress]: Processing Type: InstalledPackage
2019-04-19 07:25:15: [InProgress]: Processing Type: InstalledPackage
2019-04-19 07:25:16: [InProgress]: Processing Type: InstalledPackage
2019-04-19 07:25:17: [InProgress]: Processing Type: InstalledPackage
2019-04-19 07:25:18: [InProgress]: Processing Type: InstalledPackage
2019-04-19 07:25:19: [InProgress]: Processing Type: InstalledPackage
2019-04-19 07:25:21: [InProgress]: Processing Type: InstalledPackage
2019-04-19 07:25:22: [InProgress]: Processing Type: InstalledPackage
2019-04-19 07:25:23: [InProgress]: Processing Type: InstalledPackage
2019-04-19 07:25:24: [InProgress]: Processing Type: InstalledPackage
2019-04-19 07:25:26: [InProgress]: Processing Type: InstalledPackage
2019-04-19 07:25:27: [InProgress]: Processing Type: InstalledPackage
2019-04-19 07:25:28: [InProgress]: Processing Type: InstalledPackage
2019-04-19 07:25:29: [InProgress]: Processing Type: InstalledPackage
2019-04-19 07:25:30: [InProgress]: Processing Type: InstalledPackage
2019-04-19 07:25:32: [InProgress]: Processing Type: InstalledPackage
2019-04-19 07:25:33: [InProgress]: next check in 1 seconds
2019-04-19 07:25:34: [Done]
2019-04-19 07:25:35: [Success]: Succeeded
2019-04-19 07:25:35: Installing npo02 version 3.12 (Beta 1)
2019-04-19 07:25:35: Pending
2019-04-19 07:25:36: [Pending]: next check in 1 seconds
2019-04-19 07:25:37: [Pending]: next check in 1 seconds
2019-04-19 07:25:38: [Pending]: next check in 2 seconds
2019-04-19 07:25:40: [Pending]: next check in 2 seconds
2019-04-19 07:25:42: [Pending]: next check in 2 seconds
2019-04-19 07:25:45: [Pending]: next check in 3 seconds
2019-04-19 07:25:48: [Pending]: next check in 3 seconds
2019-04-19 07:25:51: [Pending]: next check in 3 seconds
2019-04-19 07:25:54: [InProgress]: Processing Type: InstalledPackage
2019-04-19 07:25:55: [InProgress]: Processing Type: InstalledPackage
2019-04-19 07:25:57: [InProgress]: Processing Type: InstalledPackage
2019-04-19 07:25:58: [InProgress]: Processing Type: InstalledPackage
2019-04-19 07:25:59: [InProgress]: Processing Type: InstalledPackage
2019-04-19 07:26:00: [InProgress]: Processing Type: InstalledPackage
2019-04-19 07:26:01: [InProgress]: Processing Type: InstalledPackage
2019-04-19 07:26:03: [InProgress]: Processing Type: InstalledPackage
2019-04-19 07:26:04: [InProgress]: Processing Type: InstalledPackage
2019-04-19 07:26:05: [InProgress]: Processing Type: InstalledPackage
2019-04-19 07:26:06: [InProgress]: Processing Type: InstalledPackage
2019-04-19 07:26:07: [InProgress]: Processing Type: InstalledPackage
2019-04-19 07:26:09: [InProgress]: Processing Type: InstalledPackage
2019-04-19 07:26:10: [InProgress]: Processing Type: InstalledPackage
2019-04-19 07:26:11: [InProgress]: Processing Type: InstalledPackage
2019-04-19 07:26:12: [InProgress]: Processing Type: InstalledPackage
2019-04-19 07:26:13: [InProgress]: Processing Type: InstalledPackage
2019-04-19 07:26:15: [InProgress]: Processing Type: InstalledPackage
2019-04-19 07:26:16: [InProgress]: Processing Type: InstalledPackage
2019-04-19 07:26:17: [InProgress]: Processing Type: InstalledPackage
2019-04-19 07:26:18: [InProgress]: Processing Type: InstalledPackage
2019-04-19 07:26:19: [InProgress]: Processing Type: InstalledPackage
2019-04-19 07:26:21: [InProgress]: Processing Type: InstalledPackage
2019-04-19 07:26:22: [InProgress]: Processing Type: InstalledPackage
2019-04-19 07:26:23: [InProgress]: Processing Type: InstalledPackage
2019-04-19 07:26:24: [InProgress]: Processing Type: InstalledPackage
2019-04-19 07:26:26: [InProgress]: Processing Type: InstalledPackage
2019-04-19 07:26:27: [InProgress]: Processing Type: InstalledPackage
2019-04-19 07:26:28: [InProgress]: Processing Type: InstalledPackage
2019-04-19 07:26:29: [InProgress]: Processing Type: InstalledPackage
2019-04-19 07:26:31: [InProgress]: Processing Type: InstalledPackage
2019-04-19 07:26:32: [InProgress]: Processing Type: InstalledPackage
2019-04-19 07:26:33: [InProgress]: Processing Type: InstalledPackage
2019-04-19 07:26:34: [InProgress]: Processing Type: InstalledPackage
2019-04-19 07:26:36: [InProgress]: Processing Type: InstalledPackage
2019-04-19 07:26:37: [InProgress]: Processing Type: InstalledPackage
2019-04-19 07:26:38: [InProgress]: Processing Type: InstalledPackage
2019-04-19 07:26:39: [InProgress]: Processing Type: InstalledPackage
2019-04-19 07:26:41: [Done]
2019-04-19 07:26:42: [Success]: Succeeded
2019-04-19 07:26:42: Installing npe03 version 3.13
2019-04-19 07:26:42: Pending
2019-04-19 07:26:42: [Pending]: next check in 1 seconds
2019-04-19 07:26:43: [Pending]: next check in 1 seconds
2019-04-19 07:26:44: [Pending]: next check in 2 seconds
2019-04-19 07:26:47: [InProgress]: Processing Type: InstalledPackage
2019-04-19 07:26:48: [InProgress]: Processing Type: InstalledPackage
2019-04-19 07:26:49: [InProgress]: Processing Type: InstalledPackage
2019-04-19 07:26:50: [InProgress]: Processing Type: InstalledPackage
2019-04-19 07:26:51: [InProgress]: Processing Type: InstalledPackage
2019-04-19 07:26:53: [InProgress]: Processing Type: InstalledPackage
2019-04-19 07:26:54: [InProgress]: Processing Type: InstalledPackage
2019-04-19 07:26:55: [InProgress]: Processing Type: InstalledPackage
2019-04-19 07:26:56: [InProgress]: Processing Type: InstalledPackage
2019-04-19 07:26:58: [InProgress]: Processing Type: InstalledPackage
2019-04-19 07:26:59: [InProgress]: Processing Type: InstalledPackage
2019-04-19 07:27:00: [InProgress]: Processing Type: InstalledPackage
2019-04-19 07:27:01: [InProgress]: Processing Type: InstalledPackage
2019-04-19 07:27:02: [InProgress]: Processing Type: InstalledPackage
2019-04-19 07:27:04: [InProgress]: Processing Type: InstalledPackage
2019-04-19 07:27:05: [InProgress]: Processing Type: InstalledPackage
2019-04-19 07:27:06: [InProgress]: Processing Type: InstalledPackage
2019-04-19 07:27:07: [InProgress]: Processing Type: InstalledPackage
2019-04-19 07:27:08: [InProgress]: Processing Type: InstalledPackage
2019-04-19 07:27:10: [Done]
2019-04-19 07:27:11: [Success]: Succeeded
2019-04-19 07:27:11: Installing npe4 version 3.8
2019-04-19 07:27:11: Pending
2019-04-19 07:27:11: [Pending]: next check in 1 seconds
2019-04-19 07:27:13: [InProgress]: Processing Type: InstalledPackage
2019-04-19 07:27:14: [InProgress]: Processing Type: InstalledPackage
2019-04-19 07:27:15: [InProgress]: Processing Type: InstalledPackage
2019-04-19 07:27:16: [InProgress]: Processing Type: InstalledPackage
2019-04-19 07:27:17: [InProgress]: Processing Type: InstalledPackage
2019-04-19 07:27:19: [InProgress]: Processing Type: InstalledPackage
2019-04-19 07:27:20: [InProgress]: Processing Type: InstalledPackage
2019-04-19 07:27:21: [InProgress]: Processing Type: InstalledPackage
2019-04-19 07:27:22: [InProgress]: Processing Type: InstalledPackage
2019-04-19 07:27:24: [InProgress]: Processing Type: InstalledPackage
2019-04-19 07:27:25: [InProgress]: Processing Type: InstalledPackage
2019-04-19 07:27:26: [InProgress]: Processing Type: InstalledPackage
2019-04-19 07:27:27: [InProgress]: Processing Type: InstalledPackage
2019-04-19 07:27:28: [InProgress]: Processing Type: InstalledPackage
2019-04-19 07:27:30: [InProgress]: Processing Type: InstalledPackage
2019-04-19 07:27:31: [InProgress]: Processing Type: InstalledPackage
2019-04-19 07:27:32: [InProgress]: Processing Type: InstalledPackage
2019-04-19 07:27:33: [InProgress]: Processing Type: InstalledPackage
2019-04-19 07:27:35: [Done]
2019-04-19 07:27:36: [Success]: Succeeded
2019-04-19 07:27:36: Installing npe5 version 3.8 (Beta 25)
2019-04-19 07:27:36: Pending
2019-04-19 07:27:36: [Pending]: next check in 1 seconds
2019-04-19 07:27:37: [InProgress]: Processing Type: InstalledPackage
2019-04-19 07:27:39: [InProgress]: Processing Type: InstalledPackage
2019-04-19 07:27:40: [InProgress]: Processing Type: InstalledPackage
2019-04-19 07:27:41: [InProgress]: Processing Type: InstalledPackage
2019-04-19 07:27:42: [InProgress]: Processing Type: InstalledPackage
2019-04-19 07:27:44: [InProgress]: Processing Type: InstalledPackage
2019-04-19 07:27:45: [InProgress]: Processing Type: InstalledPackage
2019-04-19 07:27:46: [InProgress]: Processing Type: InstalledPackage
2019-04-19 07:27:47: [InProgress]: Processing Type: InstalledPackage
2019-04-19 07:27:48: [InProgress]: Processing Type: InstalledPackage
2019-04-19 07:27:50: [InProgress]: Processing Type: InstalledPackage
2019-04-19 07:27:51: [InProgress]: Processing Type: InstalledPackage
2019-04-19 07:27:52: [InProgress]: Processing Type: InstalledPackage
2019-04-19 07:27:53: [InProgress]: Processing Type: InstalledPackage
2019-04-19 07:27:55: [InProgress]: Processing Type: InstalledPackage
2019-04-19 07:27:56: [Done]
2019-04-19 07:27:57: [Success]: Succeeded
2019-04-19 07:27:57: ------------------------------------------------------------
2019-04-19 07:27:57: Running task: deploy_pre
2019-04-19 07:27:57: ------------------------------------------------------------
2019-04-19 07:27:57: 
2019-04-19 07:27:57: Options:
2019-04-19 07:27:57:   path: unpackaged/pre
2019-04-19 07:27:57: Beginning task: DeployBundles
2019-04-19 07:27:57: 
2019-04-19 07:27:57: Deploying all metadata bundles in path /tmp/tmpsx6od9iu/SalesforceFoundation-Cumulus-4763744/unpackaged/pre
2019-04-19 07:27:57: Deploying bundle: unpackaged/pre/account_record_types
2019-04-19 07:27:57: Cleaning meta.xml files of packageVersion elements for deploy
2019-04-19 07:27:57: Payload size: 872 bytes
2019-04-19 07:27:57: Pending
2019-04-19 07:27:57: [InProgress]: Processing Type: CustomObject
2019-04-19 07:27:59: [InProgress]: Processing Type: CustomObject
2019-04-19 07:28:00: [InProgress]: next check in 1 seconds
2019-04-19 07:28:01: [Done]
2019-04-19 07:28:02: [Success]: Succeeded
2019-04-19 07:28:02: Deploying bundle: unpackaged/pre/opportunity_record_types
2019-04-19 07:28:02: Cleaning meta.xml files of packageVersion elements for deploy
2019-04-19 07:28:02: Payload size: 1016 bytes
2019-04-19 07:28:02: Pending
2019-04-19 07:28:03: [InProgress]: Processing Type: CustomObject
2019-04-19 07:28:04: [InProgress]: Processing Type: CustomObject
2019-04-19 07:28:05: [Done]
2019-04-19 07:28:06: [Success]: Succeeded
2019-04-19 07:28:06: ------------------------------------------------------------
2019-04-19 07:28:06: Running task: unschedule_apex
2019-04-19 07:28:06: ------------------------------------------------------------
2019-04-19 07:28:06: 
2019-04-19 07:28:06: Options:
2019-04-19 07:28:06:   apex: for (CronTrigger t : [SELECT Id FROM CronTrigger]) { System.abortJob(t.Id); }
2019-04-19 07:28:06: Beginning task: AnonymousApexTask
2019-04-19 07:28:06: 
2019-04-19 07:28:06: Executing anonymous Apex
2019-04-19 07:28:07: Anonymous Apex Success
2019-04-19 07:28:07: ------------------------------------------------------------
2019-04-19 07:28:07: Running task: update_package_xml
2019-04-19 07:28:07: ------------------------------------------------------------
2019-04-19 07:28:07: 
2019-04-19 07:28:07: Options:
2019-04-19 07:28:07:   path: src
2019-04-19 07:28:07:   managed: False
2019-04-19 07:28:07: Beginning task: UpdatePackageXml
2019-04-19 07:28:07: 
2019-04-19 07:28:07: Generating src/package.xml from metadata in src
2019-04-19 07:28:07: ------------------------------------------------------------
2019-04-19 07:28:07: Running task: deploy
2019-04-19 07:28:07: ------------------------------------------------------------
2019-04-19 07:28:07: 
2019-04-19 07:28:07: Options:
2019-04-19 07:28:07:   path: src
2019-04-19 07:28:07: Beginning task: Deploy
2019-04-19 07:28:07: 
2019-04-19 07:28:08: Cleaning meta.xml files of packageVersion elements for deploy
2019-04-19 07:28:09: Cleaned package versions from 614 meta.xml files
2019-04-19 07:28:09: Payload size: 6370764 bytes
2019-04-19 07:28:09: Pending
2019-04-19 07:28:13: [Pending]: next check in 1 seconds
2019-04-19 07:28:14: [InProgress]: Processing Type: CustomLabels
2019-04-19 07:28:15: [InProgress]: Processing Type: CustomLabels
2019-04-19 07:28:16: [InProgress]: Processing Type: CustomLabels
2019-04-19 07:28:17: [InProgress]: Processing Type: CustomLabels
2019-04-19 07:28:19: [InProgress]: Processing Type: CustomLabels
2019-04-19 07:28:20: [InProgress]: Processing Type: AuraDefinitionBundle
2019-04-19 07:28:21: [InProgress]: Processing Type: AuraDefinitionBundle
2019-04-19 07:28:22: [InProgress]: Processing Type: AuraDefinitionBundle
2019-04-19 07:28:24: [InProgress]: Processing Type: AuraDefinitionBundle
2019-04-19 07:28:25: [InProgress]: Processing Type: ApexComponent
2019-04-19 07:28:26: [InProgress]: Processing Type: ApexComponent
2019-04-19 07:28:27: [InProgress]: Processing Type: ApexPage
2019-04-19 07:28:28: [InProgress]: Processing Type: ApexPage
2019-04-19 07:28:30: [InProgress]: Processing Type: ApexPage
2019-04-19 07:28:31: [InProgress]: Processing Type: ApexPage
2019-04-19 07:28:32: [InProgress]: Processing Type: ApexPage
2019-04-19 07:28:33: [InProgress]: Processing Type: ApexPage
2019-04-19 07:28:35: [InProgress]: Processing Type: ApexPage
2019-04-19 07:28:36: [InProgress]: Processing Type: ApexPage
2019-04-19 07:28:37: [InProgress]: next check in 1 seconds
2019-04-19 07:28:38: [InProgress]: Processing Type: CustomObject
2019-04-19 07:28:40: [InProgress]: Processing Type: CustomObject
2019-04-19 07:28:41: [InProgress]: Processing Type: CustomObject
2019-04-19 07:28:42: [InProgress]: Processing Type: CustomObject
2019-04-19 07:28:44: [InProgress]: Processing Type: CustomObject
2019-04-19 07:28:45: [InProgress]: Processing Type: CustomObject
2019-04-19 07:28:46: [InProgress]: Processing Type: CustomObject
2019-04-19 07:28:47: [InProgress]: next check in 1 seconds
2019-04-19 07:28:48: [InProgress]: next check in 1 seconds
2019-04-19 07:28:50: [InProgress]: next check in 1 seconds
2019-04-19 07:28:51: [InProgress]: next check in 1 seconds
2019-04-19 07:28:52: [InProgress]: next check in 1 seconds
2019-04-19 07:28:53: [InProgress]: next check in 1 seconds
2019-04-19 07:28:54: [InProgress]: next check in 1 seconds
2019-04-19 07:28:56: [InProgress]: next check in 1 seconds
2019-04-19 07:28:57: [InProgress]: next check in 1 seconds
2019-04-19 07:28:58: [InProgress]: next check in 1 seconds
2019-04-19 07:28:59: [InProgress]: next check in 1 seconds
2019-04-19 07:29:01: [InProgress]: next check in 1 seconds
2019-04-19 07:29:02: [InProgress]: Processing Type: ReportType
2019-04-19 07:29:03: [InProgress]: Processing Type: Report
2019-04-19 07:29:05: [InProgress]: Processing Type: Layout
2019-04-19 07:29:07: [InProgress]: Processing Type: Layout
2019-04-19 07:29:08: [InProgress]: Processing Type: Layout
2019-04-19 07:29:10: [InProgress]: Processing Type: Layout
2019-04-19 07:29:11: [InProgress]: Processing Type: Layout
2019-04-19 07:29:13: [InProgress]: Processing Type: QuickAction
2019-04-19 07:29:14: [InProgress]: Processing Type: CustomApplication
2019-04-19 07:29:16: [InProgress]: Processing Type: Workflow
2019-04-19 07:29:17: [InProgress]: Processing Type: Workflow
2019-04-19 07:29:19: [InProgress]: Processing Type: CustomObjectTranslation
2019-04-19 07:29:20: [InProgress]: Processing Type: CustomObjectTranslation
2019-04-19 07:29:21: [InProgress]: Processing Type: CustomObjectTranslation
2019-04-19 07:29:23: [InProgress]: Processing Type: CustomObjectTranslation
2019-04-19 07:29:24: [InProgress]: Processing Type: CustomObjectTranslation
2019-04-19 07:29:26: [InProgress]: Processing Type: CustomObjectTranslation
2019-04-19 07:29:27: [InProgress]: Processing Type: Translations
2019-04-19 07:29:29: [InProgress]: Processing Type: Translations
2019-04-19 07:29:30: [InProgress]: Processing Type: ApexClass
2019-04-19 07:29:32: [InProgress]: Processing Type: ApexClass
2019-04-19 07:29:33: [InProgress]: Processing Type: ApexClass
2019-04-19 07:29:35: [InProgress]: Processing Type: ApexClass
2019-04-19 07:29:36: [InProgress]: Processing Type: ApexClass
2019-04-19 07:29:38: [InProgress]: Processing Type: ApexClass
2019-04-19 07:29:39: [InProgress]: Processing Type: ApexClass
2019-04-19 07:29:41: [InProgress]: Processing Type: ApexClass
2019-04-19 07:29:42: [InProgress]: Processing Type: ApexClass
2019-04-19 07:29:44: [InProgress]: Processing Type: ApexClass
2019-04-19 07:29:45: [InProgress]: Processing Type: ApexClass
2019-04-19 07:29:47: [InProgress]: Processing Type: ApexClass
2019-04-19 07:29:48: [InProgress]: Processing Type: ApexClass
2019-04-19 07:29:49: [InProgress]: Processing Type: ApexClass
2019-04-19 07:29:51: [InProgress]: Processing Type: ApexClass
2019-04-19 07:29:52: [InProgress]: Processing Type: ApexClass
2019-04-19 07:29:54: [InProgress]: Processing Type: ApexClass
2019-04-19 07:29:55: [InProgress]: Processing Type: ApexClass
2019-04-19 07:29:57: [InProgress]: Processing Type: ApexClass
2019-04-19 07:29:59: [InProgress]: Processing Type: ApexClass
2019-04-19 07:30:00: [InProgress]: Processing Type: ApexClass
2019-04-19 07:30:02: [InProgress]: Processing Type: ApexClass
2019-04-19 07:30:03: [InProgress]: Processing Type: ApexClass
2019-04-19 07:30:04: [InProgress]: Processing Type: ApexClass
2019-04-19 07:30:06: [InProgress]: Processing Type: ApexClass
2019-04-19 07:30:07: [InProgress]: Processing Type: ApexClass
2019-04-19 07:30:09: [InProgress]: Processing Type: ApexClass
2019-04-19 07:30:10: [InProgress]: Processing Type: ApexClass
2019-04-19 07:30:12: [InProgress]: Processing Type: ApexClass
2019-04-19 07:30:13: [InProgress]: Processing Type: ApexClass
2019-04-19 07:30:15: [InProgress]: Processing Type: ApexClass
2019-04-19 07:30:16: [InProgress]: Processing Type: ApexClass
2019-04-19 07:30:18: [InProgress]: Processing Type: ApexClass
2019-04-19 07:30:20: [InProgress]: Processing Type: ApexClass
2019-04-19 07:30:21: [InProgress]: Processing Type: ApexClass
2019-04-19 07:30:23: [InProgress]: Processing Type: ApexClass
2019-04-19 07:30:24: [InProgress]: Processing Type: ApexClass
2019-04-19 07:30:26: [InProgress]: Processing Type: ApexTrigger
2019-04-19 07:30:28: [InProgress]: Processing Type: ApexTrigger
2019-04-19 07:30:30: [InProgress]: Processing Type: ApexTrigger
2019-04-19 07:30:32: [InProgress]: Processing Type: CustomMetadata
2019-04-19 07:30:34: [InProgress]: Processing Type: CustomMetadata
2019-04-19 07:30:36: [InProgress]: Processing Type: MatchingRules
2019-04-19 07:30:39: [InProgress]: Processing Type: MatchingRules
2019-04-19 07:30:41: [InProgress]: Processing Type: MatchingRules
2019-04-19 07:30:43: [InProgress]: Processing Type: MatchingRules
2019-04-19 07:30:44: [InProgress]: Processing Type: MatchingRules
2019-04-19 07:30:46: [InProgress]: Processing Type: MatchingRules
2019-04-19 07:30:49: [InProgress]: Processing Type: MatchingRules
2019-04-19 07:30:52: [InProgress]: Processing Type: MatchingRules
2019-04-19 07:30:55: [InProgress]: Processing Type: MatchingRules
2019-04-19 07:30:58: [InProgress]: Processing Type: MatchingRules
2019-04-19 07:31:01: [InProgress]: Processing Type: MatchingRules
2019-04-19 07:31:05: [InProgress]: Processing Type: MatchingRules
2019-04-19 07:31:08: [InProgress]: Processing Type: MatchingRules
2019-04-19 07:31:11: [InProgress]: Processing Type: MatchingRules
2019-04-19 07:31:14: [InProgress]: Processing Type: MatchingRules
2019-04-19 07:31:16: [InProgress]: Processing Type: MatchingRules
2019-04-19 07:31:19: [InProgress]: Processing Type: MatchingRules
2019-04-19 07:31:22: [InProgress]: Processing Type: MatchingRules
2019-04-19 07:31:24: [InProgress]: Processing Type: MatchingRules
2019-04-19 07:31:27: [InProgress]: next check in 1 seconds
2019-04-19 07:31:30: [InProgress]: next check in 1 seconds
2019-04-19 07:31:33: [InProgress]: next check in 1 seconds
2019-04-19 07:31:36: [Done]
2019-04-19 07:31:37: [Success]: Succeeded
2019-04-19 07:31:37: ------------------------------------------------------------
2019-04-19 07:31:37: Running task: uninstall_packaged_incremental
2019-04-19 07:31:37: ------------------------------------------------------------
2019-04-19 07:31:37: 
2019-04-19 07:31:37: Options:
2019-04-19 07:31:37:   path: /tmp/tmpsx6od9iu/SalesforceFoundation-Cumulus-4763744/src
2019-04-19 07:31:37:   package: Cumulus
2019-04-19 07:31:37:   purge_on_delete: True
2019-04-19 07:31:37:   ignore: OrderedDict([('QuickAction', ['NewEvent', 'NewCase', 'SendEmail']), ('FlexiPage', ['NPSP_Address_Record_Page', 'NPSP_Deliverable', 'NPSP_Engagement_Plan_Record_Page', 'NPSP_GAU_Allocation', 'NPSP_General_Accounting_Unit'])])
2019-04-19 07:31:37: Beginning task: UninstallPackagedIncremental
2019-04-19 07:31:37: 
2019-04-19 07:31:37: Retrieving metadata in package Cumulus from target org
2019-04-19 07:31:37: Pending
2019-04-19 07:31:38: [Pending]: next check in 1 seconds
2019-04-19 07:31:39: [Pending]: next check in 1 seconds
2019-04-19 07:31:40: [Pending]: next check in 2 seconds
2019-04-19 07:31:42: [Pending]: next check in 2 seconds
2019-04-19 07:31:45: [Pending]: next check in 2 seconds
2019-04-19 07:31:47: [Pending]: next check in 3 seconds
2019-04-19 07:31:51: [Pending]: next check in 3 seconds
2019-04-19 07:31:54: [Done]
2019-04-19 07:32:03: No metadata found to delete
2019-04-19 07:32:03: ------------------------------------------------------------
2019-04-19 07:32:03: Running task: deploy_post
2019-04-19 07:32:03: ------------------------------------------------------------
2019-04-19 07:32:03: 
2019-04-19 07:32:03: Options:
2019-04-19 07:32:03:   path: unpackaged/post
2019-04-19 07:32:03:   unmanaged: True
2019-04-19 07:32:03:   namespace_inject: npsp
2019-04-19 07:32:03: Beginning task: DeployBundles
2019-04-19 07:32:03: 
2019-04-19 07:32:03: Deploying all metadata bundles in path /tmp/tmpsx6od9iu/SalesforceFoundation-Cumulus-4763744/unpackaged/post
2019-04-19 07:32:03: Deploying bundle: unpackaged/post/first
2019-04-19 07:32:03: Stripping namespace tokens from metadata for unmanaged deployment
2019-04-19 07:32:03:   layouts/Global-Global Layout.layout: Replaced %%%NAMESPACE%%% with "npsp"
2019-04-19 07:32:03:   objects/Account.object: Replaced %%%NAMESPACE%%% with "npsp"
2019-04-19 07:32:03: Cleaning meta.xml files of packageVersion elements for deploy
2019-04-19 07:32:03: Payload size: 3168 bytes
2019-04-19 07:32:03: Pending
2019-04-19 07:32:04: [InProgress]: Processing Type: CustomObject
2019-04-19 07:32:05: [InProgress]: Processing Type: CustomObject
2019-04-19 07:32:06: [InProgress]: next check in 1 seconds
2019-04-19 07:32:08: [Done]
2019-04-19 07:32:09: [Success]: Succeeded
2019-04-19 07:32:09: ------------------------------------------------------------
2019-04-19 07:32:09: Running task: update_admin_profile
2019-04-19 07:32:09: ------------------------------------------------------------
2019-04-19 07:32:09: 
2019-04-19 07:32:09: Options:
2019-04-19 07:32:09:   package_xml: lib/admin_profile.xml
2019-04-19 07:32:09:   record_types: [OrderedDict([('record_type', 'Account.HH_Account')]), OrderedDict([('record_type', 'Account.Organization'), ('default', True), ('person_account_default', True)]), OrderedDict([('record_type', 'Opportunity.NPSP_Default'), ('default', True)])]
2019-04-19 07:32:09:   managed: False
2019-04-19 07:32:09:   namespaced_org: False
2019-04-19 07:32:09: Beginning task: UpdateAdminProfile
2019-04-19 07:32:09: 
2019-04-19 07:32:09: Retrieving metadata using lib/admin_profile.xml
2019-04-19 07:32:09: Pending
2019-04-19 07:32:09: [Pending]: next check in 1 seconds
2019-04-19 07:32:11: [Pending]: next check in 1 seconds
2019-04-19 07:32:12: [Pending]: next check in 2 seconds
2019-04-19 07:32:14: [Pending]: next check in 2 seconds
2019-04-19 07:32:16: [Pending]: next check in 2 seconds
2019-04-19 07:32:19: [Pending]: next check in 3 seconds
2019-04-19 07:32:22: [Done]
2019-04-19 07:32:25: Processing retrieved metadata in /tmp/tmpq7c66hj4
2019-04-19 07:32:25: Deploying updated Admin.profile from /tmp/tmpq7c66hj4
2019-04-19 07:32:26: Cleaning meta.xml files of packageVersion elements for deploy
2019-04-19 07:32:26: Payload size: 145300 bytes
2019-04-19 07:32:26: Pending
2019-04-19 07:32:26: [Pending]: next check in 1 seconds
2019-04-19 07:32:28: [InProgress]: Processing Type: CustomObject
2019-04-19 07:32:29: [InProgress]: Processing Type: CustomObject
2019-04-19 07:32:30: [InProgress]: Processing Type: CustomObject
2019-04-19 07:32:31: [InProgress]: Processing Type: CustomObject
2019-04-19 07:32:32: [InProgress]: Processing Type: CustomObject
2019-04-19 07:32:34: [InProgress]: Processing Type: CustomObject
2019-04-19 07:32:35: [InProgress]: Processing Type: CustomObject
2019-04-19 07:32:36: [InProgress]: Processing Type: CustomObject
2019-04-19 07:32:37: [InProgress]: next check in 1 seconds
2019-04-19 07:32:39: [InProgress]: next check in 1 seconds
2019-04-19 07:32:40: [InProgress]: next check in 1 seconds
2019-04-19 07:32:41: [InProgress]: Processing Type: Profile
2019-04-19 07:32:43: [InProgress]: Processing Type: Profile
2019-04-19 07:32:45: [InProgress]: Processing Type: Profile
2019-04-19 07:32:46: [InProgress]: Processing Type: Profile
2019-04-19 07:32:48: [Done]
2019-04-19 07:32:49: [Success]: Succeeded
2019-04-19 07:32:50: ------------------------------------------------------------
2019-04-19 07:32:50: Running task: run_tests
2019-04-19 07:32:50: ------------------------------------------------------------
2019-04-19 07:32:50: 
2019-04-19 07:32:50: Options:
2019-04-19 07:32:50:   test_name_match: %_TEST%
2019-04-19 07:32:50:   test_name_exclude: 
2019-04-19 07:32:50:   namespace: npsp
2019-04-19 07:32:50:   managed: False
2019-04-19 07:32:50:   retries: 10
2019-04-19 07:32:50:   retry_interval: 5
2019-04-19 07:32:50:   retry_interval_add: 5
2019-04-19 07:32:50:   junit_output: test_results.xml
2019-04-19 07:32:50:   json_output: test_results.json
2019-04-19 07:32:50: Beginning task: RunApexTests
2019-04-19 07:32:50: 
2019-04-19 07:32:50: Running query: SELECT Id, Name FROM ApexClass WHERE NamespacePrefix = null AND (Name LIKE '%_TEST%')
2019-04-19 07:32:50: Found 172 test classes
2019-04-19 07:32:50: Queuing tests for execution...
2019-04-19 07:32:51: Completed: 0  Processing: 2  Queued: 170
2019-04-19 07:32:53: Completed: 0  Processing: 19  Queued: 153
2019-04-19 07:32:54: Completed: 4  Processing: 21  Queued: 147
2019-04-19 07:32:55: Increased polling interval to 2 seconds
2019-04-19 07:32:55: Completed: 10  Processing: 19  Queued: 143
2019-04-19 07:32:57: Completed: 16  Processing: 16  Queued: 140
2019-04-19 07:32:59: Completed: 21  Processing: 11  Queued: 140
2019-04-19 07:33:01: Increased polling interval to 3 seconds
2019-04-19 07:33:01: Completed: 24  Processing: 8  Queued: 140
2019-04-19 07:33:04: Completed: 24  Processing: 8  Queued: 140
2019-04-19 07:33:08: Completed: 25  Processing: 7  Queued: 140
2019-04-19 07:33:11: Increased polling interval to 4 seconds
2019-04-19 07:33:11: Completed: 25  Processing: 7  Queued: 140
2019-04-19 07:33:15: Completed: 25  Processing: 7  Queued: 140
2019-04-19 07:33:19: Completed: 26  Processing: 6  Queued: 140
2019-04-19 07:33:23: Increased polling interval to 5 seconds
2019-04-19 07:33:23: Completed: 26  Processing: 6  Queued: 140
2019-04-19 07:33:28: Completed: 26  Processing: 6  Queued: 140
2019-04-19 07:33:33: Completed: 26  Processing: 6  Queued: 140
2019-04-19 07:33:38: Increased polling interval to 6 seconds
2019-04-19 07:33:38: Completed: 26  Processing: 6  Queued: 140
2019-04-19 07:33:44: Completed: 28  Processing: 4  Queued: 140
2019-04-19 07:33:50: Completed: 29  Processing: 4  Queued: 139
2019-04-19 07:33:57: Increased polling interval to 7 seconds
2019-04-19 07:33:57: Completed: 31  Processing: 4  Queued: 137
2019-04-19 07:34:04: Completed: 32  Processing: 4  Queued: 136
2019-04-19 07:34:11: Completed: 34  Processing: 2  Queued: 136
2019-04-19 07:34:18: Increased polling interval to 8 seconds
2019-04-19 07:34:18: Completed: 34  Processing: 2  Queued: 136
2019-04-19 07:34:26: Completed: 36  Processing: 1  Queued: 135
2019-04-19 07:34:34: Completed: 38  Processing: 1  Queued: 133
2019-04-19 07:34:43: Increased polling interval to 9 seconds
2019-04-19 07:34:43: Completed: 40  Processing: 1  Queued: 131
2019-04-19 07:34:52: Completed: 41  Processing: 1  Queued: 130
2019-04-19 07:35:01: Completed: 41  Processing: 1  Queued: 130
2019-04-19 07:35:10: Increased polling interval to 10 seconds
2019-04-19 07:35:10: Completed: 41  Processing: 1  Queued: 130
2019-04-19 07:35:20: Completed: 42  Processing: 1  Queued: 129
2019-04-19 07:35:30: Completed: 42  Processing: 1  Queued: 129
2019-04-19 07:35:40: Increased polling interval to 11 seconds
2019-04-19 07:35:40: Completed: 42  Processing: 1  Queued: 129
2019-04-19 07:35:51: Completed: 43  Processing: 1  Queued: 128
2019-04-19 07:36:02: Completed: 43  Processing: 1  Queued: 128
2019-04-19 07:36:14: Increased polling interval to 12 seconds
2019-04-19 07:36:14: Completed: 43  Processing: 1  Queued: 128
2019-04-19 07:36:26: Completed: 44  Processing: 0  Queued: 128
2019-04-19 07:36:38: Completed: 46  Processing: 1  Queued: 125
2019-04-19 07:36:50: Increased polling interval to 13 seconds
2019-04-19 07:36:50: Completed: 48  Processing: 1  Queued: 123
2019-04-19 07:37:03: Completed: 50  Processing: 1  Queued: 121
2019-04-19 07:37:16: Completed: 51  Processing: 1  Queued: 120
2019-04-19 07:37:29: Increased polling interval to 14 seconds
2019-04-19 07:37:29: Completed: 51  Processing: 1  Queued: 120
2019-04-19 07:37:43: Completed: 53  Processing: 1  Queued: 118
2019-04-19 07:37:57: Completed: 53  Processing: 1  Queued: 118
2019-04-19 07:38:11: Increased polling interval to 15 seconds
2019-04-19 07:38:12: Completed: 54  Processing: 1  Queued: 117
2019-04-19 07:38:27: Completed: 56  Processing: 0  Queued: 116
2019-04-19 07:38:42: Completed: 56  Processing: 0  Queued: 116
2019-04-19 07:38:57: Increased polling interval to 16 seconds
2019-04-19 07:38:57: Completed: 56  Processing: 1  Queued: 115
2019-04-19 07:39:13: Completed: 56  Processing: 1  Queued: 115
2019-04-19 07:39:29: Completed: 56  Processing: 1  Queued: 115
2019-04-19 07:39:45: Increased polling interval to 17 seconds
2019-04-19 07:39:45: Completed: 56  Processing: 1  Queued: 115
2019-04-19 07:40:02: Completed: 58  Processing: 1  Queued: 113
2019-04-19 07:40:19: Completed: 60  Processing: 1  Queued: 111
2019-04-19 07:40:36: Increased polling interval to 18 seconds
2019-04-19 07:40:37: Completed: 61  Processing: 1  Queued: 110
2019-04-19 07:40:55: Completed: 61  Processing: 1  Queued: 110
2019-04-19 07:41:13: Completed: 61  Processing: 1  Queued: 110
2019-04-19 07:41:31: Increased polling interval to 19 seconds
2019-04-19 07:41:31: Completed: 62  Processing: 1  Queued: 109
2019-04-19 07:41:50: Completed: 63  Processing: 1  Queued: 108
2019-04-19 07:42:09: Completed: 64  Processing: 1  Queued: 107
2019-04-19 07:42:28: Increased polling interval to 20 seconds
2019-04-19 07:42:28: Completed: 65  Processing: 1  Queued: 106
2019-04-19 07:42:48: Completed: 65  Processing: 1  Queued: 106
2019-04-19 07:43:08: Completed: 68  Processing: 1  Queued: 103
2019-04-19 07:43:28: Increased polling interval to 21 seconds
2019-04-19 07:43:29: Completed: 70  Processing: 1  Queued: 101
2019-04-19 07:43:50: Completed: 74  Processing: 1  Queued: 97
2019-04-19 07:44:11: Completed: 76  Processing: 0  Queued: 96
2019-04-19 07:44:32: Increased polling interval to 22 seconds
2019-04-19 07:44:32: Completed: 77  Processing: 1  Queued: 94
2019-04-19 07:44:54: Completed: 79  Processing: 1  Queued: 92
2019-04-19 07:45:16: Completed: 79  Processing: 1  Queued: 92
2019-04-19 07:45:38: Increased polling interval to 23 seconds
2019-04-19 07:45:38: Completed: 80  Processing: 1  Queued: 91
2019-04-19 07:46:01: Completed: 81  Processing: 1  Queued: 90
2019-04-19 07:46:24: Completed: 81  Processing: 1  Queued: 90
2019-04-19 07:46:47: Increased polling interval to 24 seconds
2019-04-19 07:46:48: Completed: 83  Processing: 1  Queued: 88
2019-04-19 07:47:12: Completed: 84  Processing: 1  Queued: 87
2019-04-19 07:47:36: Completed: 84  Processing: 1  Queued: 87
2019-04-19 07:48:00: Increased polling interval to 25 seconds
2019-04-19 07:48:00: Completed: 84  Processing: 1  Queued: 87
2019-04-19 07:48:25: Completed: 84  Processing: 1  Queued: 87
2019-04-19 07:48:50: Completed: 84  Processing: 1  Queued: 87
2019-04-19 07:49:15: Increased polling interval to 26 seconds
2019-04-19 07:49:15: Completed: 86  Processing: 1  Queued: 85
2019-04-19 07:49:41: Completed: 89  Processing: 1  Queued: 82
2019-04-19 07:50:07: Completed: 90  Processing: 1  Queued: 81
2019-04-19 07:50:34: Increased polling interval to 27 seconds
2019-04-19 07:50:34: Completed: 91  Processing: 1  Queued: 80
2019-04-19 07:51:01: Completed: 91  Processing: 1  Queued: 80
2019-04-19 07:51:28: Completed: 93  Processing: 1  Queued: 78
2019-04-19 07:51:55: Increased polling interval to 28 seconds
2019-04-19 07:51:55: Completed: 94  Processing: 1  Queued: 77
2019-04-19 07:52:23: Completed: 94  Processing: 1  Queued: 77
2019-04-19 07:52:51: Completed: 98  Processing: 1  Queued: 73
2019-04-19 07:53:19: Increased polling interval to 29 seconds
2019-04-19 07:53:19: Completed: 98  Processing: 1  Queued: 73
2019-04-19 07:53:48: Completed: 99  Processing: 0  Queued: 73
2019-04-19 07:54:18: Completed: 101  Processing: 0  Queued: 71
2019-04-19 07:54:47: Increased polling interval to 30 seconds
2019-04-19 07:54:47: Completed: 101  Processing: 0  Queued: 71
2019-04-19 07:55:17: Completed: 101  Processing: 1  Queued: 70
2019-04-19 07:55:47: Completed: 105  Processing: 1  Queued: 66
2019-04-19 07:56:17: Increased polling interval to 31 seconds
2019-04-19 07:56:17: Completed: 113  Processing: 1  Queued: 58
2019-04-19 07:56:48: Completed: 113  Processing: 1  Queued: 58
2019-04-19 07:57:19: Completed: 116  Processing: 1  Queued: 55
2019-04-19 07:57:50: Increased polling interval to 32 seconds
2019-04-19 07:57:50: Completed: 116  Processing: 1  Queued: 55
2019-04-19 07:58:22: Completed: 118  Processing: 1  Queued: 53
2019-04-19 07:58:55: Completed: 119  Processing: 1  Queued: 52
2019-04-19 07:59:27: Increased polling interval to 33 seconds
2019-04-19 07:59:27: Completed: 121  Processing: 0  Queued: 51
2019-04-19 08:00:00: Completed: 121  Processing: 1  Queued: 50
2019-04-19 08:00:33: Completed: 122  Processing: 1  Queued: 49
2019-04-19 08:01:06: Increased polling interval to 34 seconds
2019-04-19 08:01:06: Completed: 123  Processing: 1  Queued: 48
2019-04-19 08:01:40: Completed: 123  Processing: 1  Queued: 48
2019-04-19 08:02:14: Completed: 123  Processing: 1  Queued: 48
2019-04-19 08:02:48: Increased polling interval to 35 seconds
2019-04-19 08:02:48: Completed: 123  Processing: 1  Queued: 48
2019-04-19 08:03:24: Completed: 124  Processing: 1  Queued: 47
2019-04-19 08:03:59: Completed: 124  Processing: 1  Queued: 47
2019-04-19 08:04:34: Increased polling interval to 36 seconds
2019-04-19 08:04:34: Completed: 132  Processing: 1  Queued: 39
2019-04-19 08:05:10: Completed: 132  Processing: 1  Queued: 39
2019-04-19 08:05:46: Completed: 139  Processing: 1  Queued: 32
2019-04-19 08:06:22: Increased polling interval to 37 seconds
2019-04-19 08:06:22: Completed: 145  Processing: 1  Queued: 26
2019-04-19 08:06:59: Completed: 147  Processing: 1  Queued: 24
2019-04-19 08:07:36: Completed: 148  Processing: 0  Queued: 24
2019-04-19 08:08:14: Increased polling interval to 38 seconds
2019-04-19 08:08:14: Completed: 152  Processing: 1  Queued: 19
2019-04-19 08:08:52: Completed: 154  Processing: 1  Queued: 17
2019-04-19 08:09:30: Completed: 159  Processing: 1  Queued: 12
2019-04-19 08:10:08: Increased polling interval to 39 seconds
2019-04-19 08:10:08: Completed: 161  Processing: 1  Queued: 10
2019-04-19 08:10:47: Completed: 165  Processing: 1  Queued: 6
2019-04-19 08:11:26: Completed: 167  Processing: 1  Queued: 4
2019-04-19 08:12:05: Increased polling interval to 40 seconds
2019-04-19 08:12:05: Completed: 172  Processing: 0  Queued: 0
2019-04-19 08:12:05: Apex tests completed
2019-04-19 08:12:06: Class: ACCT_AccountMerge_TEST
2019-04-19 08:12:06: 	Pass: testMergeThreeHHAccountsManyAddr (2863s)
2019-04-19 08:12:06: 	Pass: testMergeThreeOrgAccountsManyAddr (1051s)
2019-04-19 08:12:06: 	Pass: testMergeTwoHHAccounts (2537s)
2019-04-19 08:12:06: 	Pass: testMergeTwoOne2OneAccounts (1374s)
2019-04-19 08:12:06: 	Pass: testNamesAndOppsMergeHHToHH (2843s)
2019-04-19 08:12:06: 	Pass: testNamesAndOppsMergeHHToOrg (1798s)
2019-04-19 08:12:06: 	Pass: testNamesAndOppsMergeOne2OneToOne2One (1400s)
2019-04-19 08:12:06: 	Pass: testNamesAndOppsMergeOne2OneToOrg (1339s)
2019-04-19 08:12:06: 	Pass: testNamesAndOppsMergeOrgToHH (2501s)
2019-04-19 08:12:06: 	Pass: testNamesAndOppsMergeOrgToOne2One (1547s)
2019-04-19 08:12:06: Class: ACCT_CascadeDeleteLookups_TEST
2019-04-19 08:12:06: 	Pass: testAccountCascadeGrandchildren (2657s)
2019-04-19 08:12:06: 	Pass: testAccountMergeNoCascade (3773s)
2019-04-19 08:12:06: Class: ACCT_HHAccounts_TEST
2019-04-19 08:12:06: 	Pass: DeleteContactsFromHHAccounts (1349s)
2019-04-19 08:12:06: 	Pass: NewContactsEmptyHHAccounts (686s)
2019-04-19 08:12:06: 	Pass: NewContactsNoAccounts (624s)
2019-04-19 08:12:06: 	Pass: NewContactsNoAccountsWithHHObj (746s)
2019-04-19 08:12:06: 	Pass: NewContactsNonEmptyHHAccounts (693s)
2019-04-19 08:12:06: 	Pass: UndeleteContactsFromHHAccounts (1036s)
2019-04-19 08:12:06: 	Pass: UpdateContactsMergeHHAccounts (1231s)
2019-04-19 08:12:06: 	Pass: UpdateContactsSplitHHAccounts (1067s)
2019-04-19 08:12:06: 	Pass: UpdateOneToOneAndBucketContactsToHHAccounts (1055s)
2019-04-19 08:12:06: 	Pass: addContactCheckAccountPrimaryContact (1037s)
2019-04-19 08:12:06: 	Pass: addContactCheckNumberHHMembers (917s)
2019-04-19 08:12:06: 	Pass: changeContactOwners (1719s)
2019-04-19 08:12:06: 	Pass: changeContactsCheckOpps (1917s)
2019-04-19 08:12:06: 	Pass: newHHAccountWithRecordTypeOnly (176s)
2019-04-19 08:12:06: 	Pass: updateAccountToHHRecordType (727s)
2019-04-19 08:12:06: Class: ACCT_IndividualAccounts_TEST
2019-04-19 08:12:06: 	Pass: ACCT_IndividualAccounts_TEST (34s)
2019-04-19 08:12:06: 	Pass: attachToHHAccount (720s)
2019-04-19 08:12:06: 	Pass: attachToIndividualAccount (365s)
2019-04-19 08:12:06: 	Pass: changeFromOneToOneToHouseholdAccount (1092s)
2019-04-19 08:12:06: 	Pass: contactAddedToExistingHHAccount (678s)
2019-04-19 08:12:06: 	Pass: contactAddedToExistingOneToOne (604s)
2019-04-19 08:12:06: 	Pass: contactInNormalOrgNameChangeHHAccount (458s)
2019-04-19 08:12:06: 	Pass: contactInNormalOrgNameChangeOneToOne (431s)
2019-04-19 08:12:06: 	Pass: contactUpdatedToExistingOneToOne (697s)
2019-04-19 08:12:06: 	Pass: contactUpdatedToExistingOneToOneHH (1045s)
2019-04-19 08:12:06: 	Pass: deleteContactNoOppHHAccount (1002s)
2019-04-19 08:12:06: 	Pass: deleteContactNoOppOneToOne (536s)
2019-04-19 08:12:06: 	Pass: deleteContactNormalAccountHouseholdAcc (479s)
2019-04-19 08:12:06: 	Pass: deleteContactNormalAccountOneToOne (469s)
2019-04-19 08:12:06: 	Pass: deleteContactWithOppHHAccount (1242s)
2019-04-19 08:12:06: 	Pass: deleteContactWithOppOneToOne (653s)
2019-04-19 08:12:06: 	Pass: detachFromNormalAccountToBucket (554s)
2019-04-19 08:12:06: 	Pass: detachFromNormalAccountToBucketAccountProcessor (461s)
2019-04-19 08:12:06: 	Pass: detachFromNormalAccountToOneToOne (621s)
2019-04-19 08:12:06: 	Pass: detachFromNormalAccountToOneToOneHousehold (684s)
2019-04-19 08:12:06: 	Pass: detachHHAccount (656s)
2019-04-19 08:12:06: 	Pass: detachHHAccount2 (657s)
2019-04-19 08:12:06: 	Pass: detachIndividualAccount (396s)
2019-04-19 08:12:06: 	Pass: detachOneToOne (467s)
2019-04-19 08:12:06: 	Pass: editContactDuringDetachHHAccount (1296s)
2019-04-19 08:12:06: 	Pass: editContactDuringDetachOneToOne (448s)
2019-04-19 08:12:06: 	Pass: ghIssue16a (466s)
2019-04-19 08:12:06: 	Pass: ghIssue16b (580s)
2019-04-19 08:12:06: 	Pass: insertBucketChangeToPrivate (377s)
2019-04-19 08:12:06: 	Pass: insertHHAccountChangeToPrivate (695s)
2019-04-19 08:12:06: 	Pass: insertHHAccountContactTitleForRename (697s)
2019-04-19 08:12:06: 	Pass: insertHHAccountTriggerOff (159s)
2019-04-19 08:12:06: 	Pass: insertOneToOneChangeToPrivate (438s)
2019-04-19 08:12:06: 	Pass: insertOneToOneTriggerOff (142s)
2019-04-19 08:12:06: 	Pass: insertPrivateBucket (231s)
2019-04-19 08:12:06: 	Pass: insertPrivateHHAccount (241s)
2019-04-19 08:12:06: 	Pass: insertPrivateOneToOne (245s)
2019-04-19 08:12:06: 	Pass: insertUpdateOneToOne (504s)
2019-04-19 08:12:06: 	Pass: insertUpdateOneToOneHouseholds (1395s)
2019-04-19 08:12:06: 	Pass: regressionDuplicateIdInList (493s)
2019-04-19 08:12:06: 	Pass: shouldPopulateNewAccountCurrencyWithContactCurrency (419s)
2019-04-19 08:12:06: 	Pass: testContactDmlWhenHHNamingSettingsIsInvalidAndAutomaticHHNamingIsOff (478s)
2019-04-19 08:12:06: 	Pass: testContactSoqlReturnsQueryForSpecifiedContacts (949s)
2019-04-19 08:12:06: 	Pass: test_insertAsOtherUser (901s)
2019-04-19 08:12:06: 	Pass: undeleteContactToExistingHH (1113s)
2019-04-19 08:12:06: 	Pass: undeleteHHContactNoOpp (688s)
2019-04-19 08:12:06: 	Pass: undeleteHHContactWithOpp (1456s)
2019-04-19 08:12:06: 	Pass: updateHHAccountRecType (709s)
2019-04-19 08:12:06: Class: ACCT_ViewOverride_TEST
2019-04-19 08:12:06: 	Pass: accountViewOverride (568s)
2019-04-19 08:12:06: 	Pass: noAccount (15s)
2019-04-19 08:12:06: Class: ADDR_Addresses_TEST
2019-04-19 08:12:06: 	Pass: ContactRepository_getContactsShouldReturnContactsWhenAccountHasContacts (1017s)
2019-04-19 08:12:06: 	Pass: ContactRepository_getContactsShouldReturnContactsWhenAccountHasNotBeenPassedToConstructor (815s)
2019-04-19 08:12:06: 	Pass: ContactRepository_getContactsShouldReturnEmptyListWhenAccountHasNoContacts (157s)
2019-04-19 08:12:06: 	Pass: addExistingContactToNewHouseholdShouldSyncPrimaryAddressTypeWithAddressType (1128s)
2019-04-19 08:12:06: 	Pass: addNewContactToHouseholdShouldSyncPrimaryAddressTypeWithAddressType (837s)
2019-04-19 08:12:06: 	Pass: addressShouldBePropagatedToAccountsAndContactsOnMultipleTriggerCalls (15806s)
2019-04-19 08:12:06: 	Pass: clearAddrOverride (1001s)
2019-04-19 08:12:06: 	Pass: clearAddrOverrideNewAddr (1320s)
2019-04-19 08:12:06: 	Pass: deleteDefaultAddr (1457s)
2019-04-19 08:12:06: 	Pass: deleteNonDefaultOverrideAddr (1191s)
2019-04-19 08:12:06: 	Pass: insertContactWithAddress (899s)
2019-04-19 08:12:06: 	Pass: insertContactWithAddressOverride (607s)
2019-04-19 08:12:06: 	Pass: insertContactWithAddressRecreateAccount (872s)
2019-04-19 08:12:06: 	Pass: insertNewDefaultAddr (997s)
2019-04-19 08:12:06: 	Pass: insertNewDefaultAddrAndReset (1190s)
2019-04-19 08:12:06: 	Pass: insertNewSeasonalAddr (1239s)
2019-04-19 08:12:06: 	Pass: insertNewSeasonalAddrNotCurrent (1002s)
2019-04-19 08:12:06: 	Pass: newAddrNoAccount (120s)
2019-04-19 08:12:06: 	Pass: newAddrNotHHAccount (171s)
2019-04-19 08:12:06: 	Pass: newDefaultAddr (803s)
2019-04-19 08:12:06: 	Pass: setConAddrNoOverride (926s)
2019-04-19 08:12:06: 	Pass: setConAddrOverride (1055s)
2019-04-19 08:12:06: 	Pass: testAddressOverrideCreatesNewAddressWhenStateCodeIsChanged (10s)
2019-04-19 08:12:06: 	Pass: testEmptyAddressCountryIsPopulatedFromCountryCode (6s)
2019-04-19 08:12:06: 	Pass: testEmptyAddressStateIsPopulatedFromStateCode (6s)
2019-04-19 08:12:06: 	Pass: testIsMatchingStateCode (6s)
2019-04-19 08:12:06: 	Pass: updateAccAddrExisting (1316s)
2019-04-19 08:12:06: 	Pass: updateAccAddrNew (1746s)
2019-04-19 08:12:06: 	Pass: updateAddrOverride (955s)
2019-04-19 08:12:06: 	Pass: updateConAddrExisting (1482s)
2019-04-19 08:12:06: 	Pass: updateConAddrExistingAddrType (1788s)
2019-04-19 08:12:06: 	Pass: updateConAddrExistingCaseOnly (2169s)
2019-04-19 08:12:06: 	Pass: updateConAddrMarkOverride (974s)
2019-04-19 08:12:06: 	Pass: updateConAddrNew (1766s)
2019-04-19 08:12:06: 	Pass: updateDefaultAddr (924s)
2019-04-19 08:12:06: 	Pass: updateNonDefaultAddr (814s)
2019-04-19 08:12:06: Class: ADDR_Addresses_TEST2
2019-04-19 08:12:06: 	Pass: clearConAddrExisting (2624s)
2019-04-19 08:12:06: 	Pass: deleteSeasonalAddr (1419s)
2019-04-19 08:12:06: 	Pass: insertConWithAddrToExistingHH (1730s)
2019-04-19 08:12:06: 	Pass: insertConWithDefaultAddrToExistingHH (1162s)
2019-04-19 08:12:06: 	Pass: insertConWithNoAddrToExistingHH (1059s)
2019-04-19 08:12:06: 	Pass: insertContactWithMultilineStreetAddress (835s)
2019-04-19 08:12:06: 	Pass: insertNewDefaultMultilineStreetAddr (1177s)
2019-04-19 08:12:06: 	Pass: insertPartialSeasonalAddr (766s)
2019-04-19 08:12:06: 	Pass: insertSeasonalAddrOverlapExisting (968s)
2019-04-19 08:12:06: 	Pass: insertSeasonalAddrWithOverlap (817s)
2019-04-19 08:12:06: 	Pass: newAddrForOrgAccounts (550s)
2019-04-19 08:12:06: 	Pass: newDupeAccountAddr (905s)
2019-04-19 08:12:06: 	Pass: newDupeAccountAddrNonDefault (1351s)
2019-04-19 08:12:06: 	Pass: newDupeContactAddr (949s)
2019-04-19 08:12:06: 	Pass: newDupeContactAddrNonDefault (1268s)
2019-04-19 08:12:06: 	Pass: newOrgAccounts (331s)
2019-04-19 08:12:06: 	Pass: scheduleSeasonalAddrReset (1519s)
2019-04-19 08:12:06: 	Pass: scheduleSeasonalAddrUpdate (1216s)
2019-04-19 08:12:06: 	Pass: setConAddrOverrideAndLookupOnNewContact (1001s)
2019-04-19 08:12:06: 	Pass: testDisabledHHAccountAddr (512s)
2019-04-19 08:12:06: 	Pass: testSeasonalAddrOverlapLogic (13s)
2019-04-19 08:12:06: 	Pass: updateAccMultilineStreetAddr (1104s)
2019-04-19 08:12:06: 	Pass: updateAccMultilineStreetAddrNL (1223s)
2019-04-19 08:12:06: 	Pass: updateConAddrWithExternalOverride (951s)
2019-04-19 08:12:06: 	Pass: updateConAddrWithOverride (1146s)
2019-04-19 08:12:06: 	Pass: updateHHContactToNewHH (1558s)
2019-04-19 08:12:06: 	Pass: updateOrgAccounts (531s)
2019-04-19 08:12:06: 	Pass: updateOrgContactToHH (1031s)
2019-04-19 08:12:06: 	Pass: updateSeasonalAddr (1225s)
2019-04-19 08:12:06: Class: ADDR_Cicero_TEST
2019-04-19 08:12:06: 	Pass: doesNotOverwriteAddr (29s)
2019-04-19 08:12:06: 	Pass: doesOverwriteAddr (20s)
2019-04-19 08:12:06: 	Pass: singleValidAddr (20s)
2019-04-19 08:12:06: Class: ADDR_CopyAddrHHObjBTN_TEST
2019-04-19 08:12:06: 	Pass: shouldCopyAddressFromContact (444s)
2019-04-19 08:12:06: 	Pass: shouldCopyAddressFromHousehold (244s)
2019-04-19 08:12:06: 	Pass: shouldDisplayConfirmationMessageWhenBtnClicked (46s)
2019-04-19 08:12:06: 	Pass: shouldErrorWhenBtnClickedWithoutContactReadPerms (44s)
2019-04-19 08:12:06: 	Pass: shouldErrorWhenBtnClickedWithoutContactUpdatePerms (42s)
2019-04-19 08:12:06: 	Pass: shouldErrorWhenBtnClickedWithoutHHReadPerms (42s)
2019-04-19 08:12:06: 	Pass: shouldErrorWhenBtnClickedWithoutHHUpdatePerms (45s)
2019-04-19 08:12:06: 	Pass: shouldErrorWhenCopyAddressFromAccount (106s)
2019-04-19 08:12:06: 	Pass: shouldReturnHomePageWhenUnsupportedRecordId (162s)
2019-04-19 08:12:06: 	Pass: shouldReturnPageReferenceWithRecordId (39s)
2019-04-19 08:12:06: Class: ADDR_GoogleGeoAPI_Validator_TEST
2019-04-19 08:12:06: 	Pass: testAmbiguousAddress (37s)
2019-04-19 08:12:06: 	Pass: testBadResponse (14s)
2019-04-19 08:12:06: 	Pass: testInterfaceStrings (9s)
2019-04-19 08:12:06: 	Pass: testInvalidRequestAddress (15s)
2019-04-19 08:12:06: 	Pass: testNullAuthToken (13s)
2019-04-19 08:12:06: 	Pass: testOverQueryLimitAddress (16s)
2019-04-19 08:12:06: 	Pass: testRequestDeniedAddress (15s)
2019-04-19 08:12:06: 	Pass: testSingleAddress (61s)
2019-04-19 08:12:06: 	Pass: testSingleAddressLongZipcode (24s)
2019-04-19 08:12:06: 	Pass: testSingleAddressSubPremise (25s)
2019-04-19 08:12:06: 	Pass: testUnknownErrorAddress (17s)
2019-04-19 08:12:06: 	Pass: testZeroResultsAddress (18s)
2019-04-19 08:12:06: Class: ADDR_MockGoogleGeoAPIResponse_TEST
2019-04-19 08:12:06: Class: ADDR_MockHttpRespGenerator_TEST
2019-04-19 08:12:06: Class: ADDR_Validation_Gateway_TEST
2019-04-19 08:12:06: 	Pass: testBadAuth (51s)
2019-04-19 08:12:06: 	Pass: testBadInput (18s)
2019-04-19 08:12:06: 	Pass: testMultiAddress (18s)
2019-04-19 08:12:06: 	Pass: testNoSubscription (22s)
2019-04-19 08:12:06: 	Pass: testOneAddress (21s)
2019-04-19 08:12:06: 	Pass: testServerError (18s)
2019-04-19 08:12:06: 	Pass: testZip (22s)
2019-04-19 08:12:06: Class: ADDR_Validator_Batch_TEST
2019-04-19 08:12:06: 	Pass: multipleValidAddresses (14336s)
2019-04-19 08:12:06: 	Pass: multipleValidAddressessZipcodes (1513s)
2019-04-19 08:12:06: 	Pass: multipleValidZipcodes (13s)
2019-04-19 08:12:06: 	Pass: oneValidAddress (968s)
2019-04-19 08:12:06: 	Pass: oneValidZipcode (927s)
2019-04-19 08:12:06: 	Pass: validAddressInvalidZipcode (12s)
2019-04-19 08:12:06: Class: ADDR_Validator_TEST
2019-04-19 08:12:06: 	Pass: dontValidatePreviouslyValidatedAddresses (1408s)
2019-04-19 08:12:06: 	Pass: hasAccessShouldReturnFalseWhenUserHasNoAcceessOnAddress (351s)
2019-04-19 08:12:06: 	Pass: hasAccessShouldReturnTrueWhenUserIsSystemAdmin (894s)
2019-04-19 08:12:06: 	Pass: healthCheckShouldDisplayMessageOnAddressVerificationError (37s)
2019-04-19 08:12:06: 	Pass: healthCheckShouldDisplayPermissionDeniedMessageWhenUserHasNoAccess (18s)
2019-04-19 08:12:06: 	Pass: healthCheckShouldDisplaySuccessWhenAddressIsValidated (26s)
2019-04-19 08:12:06: 	Pass: healthCheckShouldNotReturnAnyMessageWhenValidatorIsNotSmartyStreets (16s)
2019-04-19 08:12:06: 	Pass: shouldEncodeUnencodedSmartyStreetsToken (13s)
2019-04-19 08:12:06: 	Pass: shouldNotEncodeAlreadyEncodedSmartyStreetsToken (14s)
2019-04-19 08:12:06: 	Pass: shouldNotEncodeUnencodedTokenWhenValidatorIsNotSmartyStreets (12s)
2019-04-19 08:12:06: 	Pass: shouldNotRetrieveApiSettingsWhenUserHasNoAccess (19s)
2019-04-19 08:12:06: 	Pass: testAddressVerificationResponse400 (1022s)
2019-04-19 08:12:06: 	Pass: testAddressVerificationResponse401 (930s)
2019-04-19 08:12:06: 	Pass: testAddressVerificationResponse402 (841s)
2019-04-19 08:12:06: 	Pass: testAddressVerificationResponse500 (860s)
2019-04-19 08:12:06: 	Pass: testBlankService (59s)
2019-04-19 08:12:06: 	Pass: testContactAddress (940s)
2019-04-19 08:12:06: 	Pass: testContactAmbiguousAddress (938s)
2019-04-19 08:12:06: 	Pass: testContactCityAndStateOnly (938s)
2019-04-19 08:12:06: 	Pass: testContactInvalidAddress (765s)
2019-04-19 08:12:06: 	Pass: testContactZipOnly (848s)
2019-04-19 08:12:06: 	Pass: testController (122s)
2019-04-19 08:12:06: 	Pass: testControllerMissingSetting (51s)
2019-04-19 08:12:06: 	Pass: verifyServiceShouldReturnNullWhenValidatorIsNotSmartyStreets (12s)
2019-04-19 08:12:06: 	Pass: verifyServiceShouldReturnPermissionDeniedMessageWhenUserHasNoAccess (16s)
2019-04-19 08:12:06: 	Pass: verifyServiceShouldReturnVerificationMessageWhenAddressIsValidated (26s)
2019-04-19 08:12:06: Class: ADV_Adapter_TEST
2019-04-19 08:12:06: 	Pass: configAccountForContactThrowException (31s)
2019-04-19 08:12:06: 	Pass: configAccountTDTMThrowException (21s)
2019-04-19 08:12:06: 	Pass: getDefaultTdtmConfigTokensThrowException (22s)
2019-04-19 08:12:06: 	Pass: moveOppsToContactAccountThrowException (20s)
2019-04-19 08:12:06: 	Pass: rollupAccountThrowException (20s)
2019-04-19 08:12:06: Class: AFFL_Affiliations_TEST
2019-04-19 08:12:06: 	Pass: contactWithMultipleAffiliations_v2 (706s)
2019-04-19 08:12:06: 	Pass: deletePrimaryAffl (1042s)
2019-04-19 08:12:06: 	Pass: newAccountNewAffl (732s)
2019-04-19 08:12:06: 	Pass: newContactOnIndividualAccount (410s)
2019-04-19 08:12:06: 	Pass: newContactOnOrgAccount (612s)
2019-04-19 08:12:06: 	Pass: newContactOnOrgAccountAutoOff (327s)
2019-04-19 08:12:06: 	Pass: newContactsWithPrimaryAffiliation (1453s)
2019-04-19 08:12:06: 	Pass: newContactsWithPrimaryAffiliationOnetoOne (845s)
2019-04-19 08:12:06: 	Pass: newPrimaryAffiliations (1234s)
2019-04-19 08:12:06: 	Pass: newPrimaryAffiliationsFromAffl (1219s)
2019-04-19 08:12:06: 	Pass: undeletePrimaryAfflNewAffl (1093s)
2019-04-19 08:12:06: 	Pass: updateContactsWithPrimaryAffiliation (1091s)
2019-04-19 08:12:06: 	Pass: updateContactsWithPrimaryAffiliationAndAccount (1225s)
2019-04-19 08:12:06: 	Pass: updateContactsWithPrimaryAffiliationClearPrimary (1019s)
2019-04-19 08:12:06: 	Pass: updateContactsWithPrimaryAffiliationToDiffAccount (1090s)
2019-04-19 08:12:06: Class: ALLO_Allocations_TEST
2019-04-19 08:12:06: 	Pass: bulkOppInsert (5350s)
2019-04-19 08:12:06: 	Pass: campaignAllocations (1036s)
2019-04-19 08:12:06: 	Pass: defaultAllocations (799s)
2019-04-19 08:12:06: 	Pass: oppAmountChange (1227s)
2019-04-19 08:12:06: 	Pass: pmtAmountChange (1399s)
2019-04-19 08:12:06: 	Pass: pmtsWithNegativeAmount (1105s)
2019-04-19 08:12:06: 	Pass: recurringDonationsValidation (2253s)
2019-04-19 08:12:06: 	Pass: testExcludedOpps (550s)
2019-04-19 08:12:06: 	Pass: testInactiveGAU (880s)
2019-04-19 08:12:06: 	Pass: testMakeDefaultAllocations (1109s)
2019-04-19 08:12:06: 	Pass: testOppAllocationGauMatchesCampaignGau (845s)
2019-04-19 08:12:06: 	Pass: testOppNullAmount (824s)
2019-04-19 08:12:06: Class: ALLO_ManageAllocations_TEST
2019-04-19 08:12:06: 	Pass: testCam (783s)
2019-04-19 08:12:06: 	Pass: testGetCurrencySymbolCallsUtilCurrency (45s)
2019-04-19 08:12:06: 	Pass: testGetCurrencySymbolReturnsCachedSymbol (13s)
2019-04-19 08:12:06: 	Pass: testGetSeparators (12s)
2019-04-19 08:12:06: 	Pass: testOpp (719s)
2019-04-19 08:12:06: 	Pass: testOppNoAmount (311s)
2019-04-19 08:12:06: 	Pass: testPayment (640s)
2019-04-19 08:12:06: 	Pass: testRD (3235s)
2019-04-19 08:12:06: 	Pass: testResaveSucceedsWhenErrorIsFixed (400s)
2019-04-19 08:12:06: 	Pass: testSaveRollsBackAllDmlsOnError (419s)
2019-04-19 08:12:06: 	Pass: testSupportedObject (505s)
2019-04-19 08:12:06: 	Pass: testUnsupportedObject (205s)
2019-04-19 08:12:06: Class: ALLO_Multicurrency_TEST
2019-04-19 08:12:06: 	Pass: alloMultiCurrency (8s)
2019-04-19 08:12:06: 	Pass: rollupMultiCurrency (8s)
2019-04-19 08:12:06: 	Pass: testMakeDefaultAllocations (8s)
2019-04-19 08:12:06: Class: ALLO_Rollup_TEST
2019-04-19 08:12:06: 	Pass: rollupBTN (953s)
2019-04-19 08:12:06: 	Pass: rollupFiscalYear (743s)
2019-04-19 08:12:06: Class: BDE_BatchDataEntry_TEST
2019-04-19 08:12:06: 	Pass: testBatchDataEntry (451s)
2019-04-19 08:12:06: Class: BDE_BatchEntry_TEST
2019-04-19 08:12:06: 	Pass: testBatchDataEntryController (766s)
2019-04-19 08:12:06: 	Pass: testBatchWithSave (1071s)
2019-04-19 08:12:06: 	Pass: testExistingBatchObjects (812s)
2019-04-19 08:12:06: 	Pass: testNewObjectLoad (123s)
2019-04-19 08:12:06: 	Pass: testOtherConfig (828s)
2019-04-19 08:12:06: Class: BDI_BatchOverride_TEST
2019-04-19 08:12:06: 	Pass: saveClonedBatch (131s)
2019-04-19 08:12:06: 	Pass: saveExistingBatch (67s)
2019-04-19 08:12:06: 	Pass: saveNewBatch (48s)
2019-04-19 08:12:06: 	Pass: testBDIBatchUISaveValidation (22s)
2019-04-19 08:12:06: Class: BDI_DataImportAPI_TEST
2019-04-19 08:12:06: 	Pass: processErrorBatch (126s)
2019-04-19 08:12:06: 	Pass: processNoBatch (1173s)
2019-04-19 08:12:06: 	Pass: processRecordsDryRun (339s)
2019-04-19 08:12:06: 	Pass: processRecordsImport (867s)
2019-04-19 08:12:06: 	Pass: processSingleBatch (975s)
2019-04-19 08:12:06: 	Pass: processTwoBatches (1545s)
2019-04-19 08:12:06: Class: BDI_DataImportBatch_TEST
2019-04-19 08:12:06: 	Pass: scheduleMaxMultipleBatches (19579s)
2019-04-19 08:12:06: 	Pass: scheduleMultipleBatches (1698s)
2019-04-19 08:12:06: 	Pass: scheduleSingleBatch (968s)
2019-04-19 08:12:06: 	Pass: scheduleTooManyMultipleBatches (18019s)
2019-04-19 08:12:06: Class: BDI_DataImportCTRL_TEST
2019-04-19 08:12:06: 	Pass: TestBDIVisualforcePage (2161s)
2019-04-19 08:12:06: 	Pass: TestBDIVisualforcePageValidation (78s)
2019-04-19 08:12:06: 	Pass: testBDIDryRun (538s)
2019-04-19 08:12:06: 	Pass: testBatchStartImportButton (40s)
2019-04-19 08:12:06: 	Pass: testUserCanEditSettings (373s)
2019-04-19 08:12:06: 	Pass: testUserCannotEditSettings (233s)
2019-04-19 08:12:06: Class: BDI_DataImportDeleteBTN_TEST
2019-04-19 08:12:06: 	Pass: TestCloseWhenRetUrlIsBlank (24s)
2019-04-19 08:12:06: 	Pass: TestCloseWhenRetUrlIsNotProvided (11s)
2019-04-19 08:12:06: 	Pass: TestCloseWhenRetUrlIsProvided (12s)
2019-04-19 08:12:06: 	Pass: TestDeleteAllDataImportRecordsBtn (332s)
2019-04-19 08:12:06: 	Pass: TestDeleteAllDataImportRecordsBtnExceptionMessageDisplay (454s)
2019-04-19 08:12:06: 	Pass: TestDeleteImportedDataImportRecordsBtn (179s)
2019-04-19 08:12:06: 	Pass: TestDeleteImportedDataImportRecordsBtnExceptionMessageDisplay (345s)
2019-04-19 08:12:06: 	Pass: TestErrorMessageDisplayWhenPageActionParameterIsInvalid (49s)
2019-04-19 08:12:06: 	Pass: TestErrorMessageDisplayWhenPageActionParameterIsNotProvided (60s)
2019-04-19 08:12:06: 	Pass: throwsExceptionWhenUserCannotDelete (239s)
2019-04-19 08:12:06: Class: BDI_DataImportService_TEST
2019-04-19 08:12:06: 	Pass: rollupTriggersAreDeactivatedWhenRunRollupSettingsIsNotChecked (145s)
2019-04-19 08:12:06: 	Pass: rollupTriggersAreNotDeactivatedWhenRunRollupSettingsIsChecked (100s)
2019-04-19 08:12:06: 	Pass: testUniqueIdHandling (11s)
2019-04-19 08:12:06: Class: BDI_DataImport_TEST
2019-04-19 08:12:06: 	Pass: ManyDISameHomeAddresses (1929s)
2019-04-19 08:12:06: 	Pass: OneDIDuplicateNewContacts (848s)
2019-04-19 08:12:06: 	Pass: OneDIExistingContacts1x1 (789s)
2019-04-19 08:12:06: 	Pass: OneDIExistingContactsCaseInsensitive (1373s)
2019-04-19 08:12:06: 	Pass: OneDIExistingContactsExistingHousehold (1274s)
2019-04-19 08:12:06: 	Pass: OneDITwoExistingContacts (1211s)
2019-04-19 08:12:06: 	Pass: OneDITwoNewAccounts (599s)
2019-04-19 08:12:06: 	Pass: OneDITwoNewContacts (965s)
2019-04-19 08:12:06: 	Pass: OneDITwoSameAccounts (553s)
2019-04-19 08:12:06: 	Pass: OneDIWithoutFirstName (1186s)
2019-04-19 08:12:06: 	Pass: TwoDIAffiliations (1398s)
2019-04-19 08:12:06: 	Pass: TwoDIDuplicateNewContacts (829s)
2019-04-19 08:12:06: 	Pass: TwoDIDuplicateNewContactsDifferentOrder (1081s)
2019-04-19 08:12:06: 	Pass: TwoDIExistingAccounts (582s)
2019-04-19 08:12:06: 	Pass: TwoDIExistingAccountsSalesforceId (1231s)
2019-04-19 08:12:06: 	Pass: TwoDIExistingHomeAddresses (1898s)
2019-04-19 08:12:06: 	Pass: TwoDIHomeAddresses (1543s)
2019-04-19 08:12:06: 	Pass: TwoDIHomeAddressesAddrMgmtOff (1133s)
2019-04-19 08:12:06: 	Pass: TwoDIMixedAddresses (1748s)
2019-04-19 08:12:06: 	Pass: TwoDIMixedAddressesAddrMgmtOff (1214s)
2019-04-19 08:12:06: 	Pass: TwoDINewContactsExistingsHousehold (1367s)
2019-04-19 08:12:06: 	Pass: TwoDISameAccounts (544s)
2019-04-19 08:12:06: 	Pass: TwoDITwoNewContacts (842s)
2019-04-19 08:12:06: 	Pass: TwoDITwoNewContactsHouseholdFields (965s)
2019-04-19 08:12:06: 	Pass: TwoDIWithAccountDonations (958s)
2019-04-19 08:12:06: 	Pass: TwoDIWithCampaignMembers (1050s)
2019-04-19 08:12:06: 	Pass: TwoDIWithDonationErrors (830s)
2019-04-19 08:12:06: 	Pass: TwoDIWithDonations (1473s)
2019-04-19 08:12:06: 	Pass: TwoDIWithDonationsAndCampaignIds (1231s)
2019-04-19 08:12:06: 	Pass: TwoDIWithDonationsAndCampaignIdsAfterDryRun (1514s)
2019-04-19 08:12:06: 	Pass: TwoDIWithDonationsAndCampaignIdsInDryRun (580s)
2019-04-19 08:12:06: 	Pass: TwoDIWithDonationsAndCampaigns (1203s)
2019-04-19 08:12:06: 	Pass: TwoDIWithDonationsAndDuplicateCampaignNameInDryRun (476s)
2019-04-19 08:12:06: 	Pass: TwoDIWithDonationsAndDuplicateCampaignNames (1606s)
2019-04-19 08:12:06: Class: BDI_DataImport_TEST2
2019-04-19 08:12:06: 	Pass: ManyDIDuplicateEmailExistingContacts (2054s)
2019-04-19 08:12:06: 	Pass: ManyDIDuplicateEmailNewContacts (892s)
2019-04-19 08:12:06: 	Pass: ManyDIDuplicateNewContactManyFields (786s)
2019-04-19 08:12:06: 	Pass: ManyDIDuplicatePhoneNewContacts (930s)
2019-04-19 08:12:06: 	Pass: ManyDIMultiContactMatchRules1 (1234s)
2019-04-19 08:12:06: 	Pass: ManyDIMultiContactMatchRules2 (1239s)
2019-04-19 08:12:06: 	Pass: ManyDIMultiContactMatchRules3 (1284s)
2019-04-19 08:12:06: 	Pass: ManyDIMultiContactMatchRules4 (1236s)
2019-04-19 08:12:06: 	Pass: ManyDIMultiContactMatchRules5 (1137s)
2019-04-19 08:12:06: 	Pass: ManyDIMultiContactMatchRules6 (1545s)
2019-04-19 08:12:06: 	Pass: ManyDIMultiContactMatchRules7 (1268s)
2019-04-19 08:12:06: 	Pass: ManyDIMultiContactMatchRules8 (1160s)
2019-04-19 08:12:06: 	Pass: ManyDIMultiContactMatchRules9 (1205s)
2019-04-19 08:12:06: 	Pass: ManyDIOverlappingEmailExistingContacts (1080s)
2019-04-19 08:12:06: 	Pass: ManyDIOverlappingPhoneExistingContacts (1057s)
2019-04-19 08:12:06: 	Pass: ManyDISalesforceIdMatchingExistingAndNewContacts (1380s)
2019-04-19 08:12:06: 	Pass: ManyDISalesforceIdMatchingExistingContacts (1207s)
2019-04-19 08:12:06: 	Pass: ManyDISomeInvalidContactData (1208s)
2019-04-19 08:12:06: 	Pass: ManyDITestAccountDataErrorHandling (1103s)
2019-04-19 08:12:06: 	Pass: ManyDITestAddressDataErrorHandling (1592s)
2019-04-19 08:12:06: 	Pass: ManyDITestCampaignDataErrorHandling (1296s)
2019-04-19 08:12:06: 	Pass: ManyDITestContactDataErrorHandling (1856s)
2019-04-19 08:12:06: 	Pass: ManyDITestDonationDataErrorHandling (1256s)
2019-04-19 08:12:06: 	Pass: ManyDIUniqueIdMatchingExistingAccounts (741s)
2019-04-19 08:12:06: 	Pass: ManyDIUniqueIdMatchingExistingContacts (1125s)
2019-04-19 08:12:06: 	Pass: ManyDIUniqueIdMatchingNewAndExistingAccounts (751s)
2019-04-19 08:12:06: 	Pass: ManyDIUniqueIdMatchingNewAndExistingContacts (1718s)
2019-04-19 08:12:06: 	Pass: ManyDIUniqueIdNewAccounts (581s)
2019-04-19 08:12:06: 	Pass: ManyDIUniqueIdNewContacts (907s)
2019-04-19 08:12:06: 	Pass: ManyDIUniqueIdNotMatchingExistingContacts (1296s)
2019-04-19 08:12:06: 	Pass: OneDISalesforceIdMatchingExistingAndNewContact (1133s)
2019-04-19 08:12:06: 	Pass: SingleDISalesforceIdMatchingExistingHousehold (1255s)
2019-04-19 08:12:06: 	Pass: TwoDIExistingC2PartialMatch (1070s)
2019-04-19 08:12:06: 	Pass: TwoDINewC2PartialMatch (977s)
2019-04-19 08:12:06: 	Pass: testFieldLevelSecurity (508s)
2019-04-19 08:12:06: 	Pass: testInvalidAccountModel (51s)
2019-04-19 08:12:06: 	Pass: testInvalidAddressHandling (1723s)
2019-04-19 08:12:06: 	Pass: testOneToOneAccountModelWithADV (13s)
2019-04-19 08:12:06: 	Pass: testPreferredEmailAutoSetting (945s)
2019-04-19 08:12:06: 	Pass: testPreferredPhoneAutoSetting (1088s)
2019-04-19 08:12:06: Class: BDI_Donations_TEST
2019-04-19 08:12:06: 	Pass: TwoDIWithExistingDonations (2548s)
2019-04-19 08:12:06: 	Pass: TwoDIWithExistingDonationsNoExtraPaymentUpdates (1777s)
2019-04-19 08:12:06: 	Pass: TwoDIWithExistingDonationsOneDupe (2416s)
2019-04-19 08:12:06: 	Pass: TwoDIWithExistingDonationsPreservePaymentDate (1927s)
2019-04-19 08:12:06: 	Pass: TwoDIWithExistingDonationsSpecified (1695s)
2019-04-19 08:12:06: 	Pass: TwoDIWithExistingDonationsSpecified_mapAndUpdateCheckbox (1678s)
2019-04-19 08:12:06: 	Pass: TwoDIWithExistingDonationsSpecified_mapCheckboxNoUpdate (1717s)
2019-04-19 08:12:06: 	Pass: TwoDIWithExistingPaymentsSpecified (1885s)
2019-04-19 08:12:06: 	Pass: TwoDIWithUserSelectedExistingDonations (2193s)
2019-04-19 08:12:06: 	Pass: TwoDIWithUserSelectedExistingDonationsApplyNewPayment (1983s)
2019-04-19 08:12:06: 	Pass: TwoDIWithUserSelectedNewOpportunities (1900s)
2019-04-19 08:12:06: 	Pass: currencyShouldCopyToOpportunity (12s)
2019-04-19 08:12:06: 	Pass: dataImportWithExistingDonationInNonDefaultCurrency (12s)
2019-04-19 08:12:06: 	Pass: dataImportWithNonMatchingCurrencyDonation (12s)
2019-04-19 08:12:06: 	Pass: donationMatchRules1 (1941s)
2019-04-19 08:12:06: 	Pass: donationMatchRules10 (1703s)
2019-04-19 08:12:06: 	Pass: donationMatchRules10b (1599s)
2019-04-19 08:12:06: 	Pass: donationMatchRules11 (1784s)
2019-04-19 08:12:06: 	Pass: donationMatchRules11b (1829s)
2019-04-19 08:12:06: 	Pass: donationMatchRules12 (1782s)
2019-04-19 08:12:06: 	Pass: donationMatchRules13 (1755s)
2019-04-19 08:12:06: 	Pass: donationMatchRules14 (1903s)
2019-04-19 08:12:06: 	Pass: donationMatchRules14b (2094s)
2019-04-19 08:12:06: 	Pass: donationMatchRules14c (2001s)
2019-04-19 08:12:06: 	Pass: donationMatchRules15 (1582s)
2019-04-19 08:12:06: 	Pass: donationMatchRules16 (1886s)
2019-04-19 08:12:06: 	Pass: donationMatchRules17 (1940s)
2019-04-19 08:12:06: 	Pass: donationMatchRules18a (1974s)
2019-04-19 08:12:06: 	Pass: donationMatchRules18b (2094s)
2019-04-19 08:12:06: 	Pass: donationMatchRules18c (2052s)
2019-04-19 08:12:06: 	Pass: donationMatchRules18d (1781s)
2019-04-19 08:12:06: 	Pass: donationMatchRules19 (1975s)
2019-04-19 08:12:06: 	Pass: donationMatchRules1b (2240s)
2019-04-19 08:12:06: 	Pass: donationMatchRules1c (1739s)
2019-04-19 08:12:06: 	Pass: donationMatchRules1d (1899s)
2019-04-19 08:12:06: 	Pass: donationMatchRules2 (1939s)
2019-04-19 08:12:06: 	Pass: donationMatchRules3 (11s)
2019-04-19 08:12:06: 	Pass: donationMatchRules4 (1858s)
2019-04-19 08:12:06: 	Pass: donationMatchRules4b (2071s)
2019-04-19 08:12:06: 	Pass: donationMatchRules5 (1936s)
2019-04-19 08:12:06: 	Pass: donationMatchRules5b (2022s)
2019-04-19 08:12:06: 	Pass: donationMatchRules6 (2059s)
2019-04-19 08:12:06: 	Pass: donationMatchRules7 (1747s)
2019-04-19 08:12:06: 	Pass: donationMatchRules7b (2140s)
2019-04-19 08:12:06: 	Pass: donationMatchRules8 (1956s)
2019-04-19 08:12:06: 	Pass: donationMatchRules9 (1916s)
2019-04-19 08:12:06: 	Pass: donationMatchRules9b (1977s)
2019-04-19 08:12:06: 	Pass: matchDonationIdToPaidClosedOppBestMatchOrCreate (2043s)
2019-04-19 08:12:06: 	Pass: matchDonationIdToPaidClosedOppDoNotMatch (2656s)
2019-04-19 08:12:06: 	Pass: matchDonationIdToPaidClosedOppExactMatchOrCreate (2159s)
2019-04-19 08:12:06: 	Pass: matchDonationIdToPaidClosedOppRequireBestMatch (2106s)
2019-04-19 08:12:06: 	Pass: matchDonationIdToPaidClosedOppRequireExactMatch (2138s)
2019-04-19 08:12:06: 	Pass: matchDonationIdToPaidClosedOppRequireNoMatch (2086s)
2019-04-19 08:12:06: 	Pass: matchPaymentIdToPaidClosedOppBestMatchOrCreate (1838s)
2019-04-19 08:12:06: 	Pass: matchPaymentIdToPaidClosedOppDoNotMatch (2013s)
2019-04-19 08:12:06: 	Pass: matchPaymentIdToPaidClosedOppExactMatchOrCreate (1968s)
2019-04-19 08:12:06: 	Pass: matchPaymentIdToPaidClosedOppRequireBestMatch (1802s)
2019-04-19 08:12:06: 	Pass: matchPaymentIdToPaidClosedOppRequireExactMatch (2159s)
2019-04-19 08:12:06: 	Pass: matchPaymentIdToPaidClosedOppRequireNoMatch (2024s)
2019-04-19 08:12:06: 	Pass: rollupShouldNotBeCalculatedWhenRollupSettingsIsNotChecked (1206s)
2019-04-19 08:12:06: Class: BDI_DryRun_TEST
2019-04-19 08:12:06: 	Pass: TwoDIWithDonationsAndCampaignIdsInDryRun (973s)
2019-04-19 08:12:06: 	Pass: TwoDIWithDonationsAndDuplicateCampaignNameInDryRun (488s)
2019-04-19 08:12:06: 	Pass: manyDIContainingErrors (579s)
2019-04-19 08:12:06: 	Pass: manyDIExistingA1A2Accounts (633s)
2019-04-19 08:12:06: 	Pass: manyDIExistingC1ContactExistingBestMatchedDonations (1570s)
2019-04-19 08:12:06: 	Pass: manyDIExistingC1ContactExistingMatchedByIdDonations (1266s)
2019-04-19 08:12:06: 	Pass: manyDIExistingC1ContactExistingMatchedByIdPayments (1217s)
2019-04-19 08:12:06: 	Pass: manyDIExistingC1ContactExistingMatchedDonations (1194s)
2019-04-19 08:12:06: 	Pass: manyDIExistingC1ContactNewDonations (947s)
2019-04-19 08:12:06: 	Pass: manyDIExistingC1ContactNewDonationsInvalidRecordtype (920s)
2019-04-19 08:12:06: 	Pass: manyDIExistingC1andC2Contacts (1026s)
2019-04-19 08:12:06: 	Pass: manyDIExistingHomeAddresses (1250s)
2019-04-19 08:12:06: 	Pass: manyDINewC1ContactNewDonations (446s)
2019-04-19 08:12:06: 	Pass: manyDINewC1andC2Contacts (471s)
2019-04-19 08:12:06: 	Pass: manyDISameBatch (494s)
2019-04-19 08:12:06: 	Pass: manyDISameNewA1A2Accounts (520s)
2019-04-19 08:12:06: 	Pass: manyDISameNewC1Contact (483s)
2019-04-19 08:12:06: 	Pass: manyDISameNewC1andC2Contacts (639s)
2019-04-19 08:12:06: 	Pass: manyDIUpdatedHomeAddresses (1419s)
2019-04-19 08:12:06: Class: BDI_PerfLogger_TEST
2019-04-19 08:12:06: 	Pass: testPerfLoggerMultipleCallsSameLabel (2090s)
2019-04-19 08:12:06: 	Pass: testPerfLoggerSaving (2032s)
2019-04-19 08:12:06: 	Pass: testPerfLoggerTiming (2030s)
2019-04-19 08:12:06: Class: BDI_PostProcess_TEST
2019-04-19 08:12:06: 	Pass: testRelCreatedForDIsWithC1AndC2 (1933s)
2019-04-19 08:12:06: Class: BDI_SettingsUI_TEST
2019-04-19 08:12:06: 	Pass: testBDISettingsUI (240s)
2019-04-19 08:12:06: Class: BGE_BatchGiftEntryTab_CTRL_TEST
2019-04-19 08:12:06: 	Pass: testGetSortedData (153s)
2019-04-19 08:12:06: 	Pass: testGetTableModel (91s)
2019-04-19 08:12:06: Class: BGE_BatchGiftEntry_UTIL_TEST
2019-04-19 08:12:06: 	Pass: testCheckFieldPermissionsNeededForBatch (125s)
2019-04-19 08:12:06: 	Pass: testHandleMissingPermissions (32s)
2019-04-19 08:12:06: 	Pass: testTruncateList (10s)
2019-04-19 08:12:06: Class: BGE_ConfigurationWizard_CTRL_TEST
2019-04-19 08:12:06: 	Pass: testGetExistingRecordDetails (821s)
2019-04-19 08:12:06: 	Pass: testGetNewBatchDetails (116s)
2019-04-19 08:12:06: 	Pass: testSaveExistingBatch (48s)
2019-04-19 08:12:06: 	Pass: testSaveNewBatchWithDefaults (70s)
2019-04-19 08:12:06: Class: BGE_DataImportBatchEntry_CTRL_TEST
2019-04-19 08:12:06: 	Pass: testDeleteDataImportRow (839s)
2019-04-19 08:12:06: 	Pass: testGetEmptyOpenDonations (360s)
2019-04-19 08:12:06: 	Pass: testGetExistingDataImport (485s)
2019-04-19 08:12:06: 	Pass: testGetNewDataImport (6s)
2019-04-19 08:12:06: 	Pass: testGetOpenDonationsWithNoOpps (71200s)
2019-04-19 08:12:06: 	Pass: testGetOpenDonationsWithNoOppsOrPayments (895s)
2019-04-19 08:12:06: 	Pass: testGetOpenDonationsWithNoPayments (635s)
2019-04-19 08:12:06: 	Pass: testGetOpenDonationsWithOppsAndPayments (11909s)
2019-04-19 08:12:06: 	Pass: testUpdateDataImports (692s)
2019-04-19 08:12:06: Class: CAM_CascadeDeleteLookups_TEST
2019-04-19 08:12:06: 	Pass: testCampaignCascadeDelete (1375s)
2019-04-19 08:12:06: Class: CAO_Constants_API_TEST
2019-04-19 08:12:06: 	Pass: test_cao_api (26s)
2019-04-19 08:12:06: Class: CDL_CascadeDeleteLookups_TEST
2019-04-19 08:12:06: Class: CMT_FilterRuleEvaluation_TEST
2019-04-19 08:12:06: 	Pass: test_evaluateFilterRules (44977s)
2019-04-19 08:12:06: Class: CMT_FilterRule_TEST
2019-04-19 08:12:06: 	Pass: constructorShouldHandleDateTimesStoredAsDates (122s)
2019-04-19 08:12:06: 	Pass: constructorShouldHandleNullDates (38s)
2019-04-19 08:12:06: 	Pass: constructorShouldHandleNullRecordTypeIds (37s)
2019-04-19 08:12:06: 	Pass: constructorShouldHandleRecordTypeDeveloperName (36s)
2019-04-19 08:12:06: 	Pass: isIncludedShouldHandleNullIds (47s)
2019-04-19 08:12:06: 	Pass: test_DateConstantComparison (36s)
2019-04-19 08:12:06: 	Pass: test_FilterRule_Selectors (81s)
2019-04-19 08:12:06: 	Pass: test_OperationMethods (61s)
2019-04-19 08:12:06: Class: CMT_MetadataAPI_TEST
2019-04-19 08:12:06: 	Fail: test_cmt_api (33s)
2019-04-19 08:12:06: 	Message: System.NullPointerException: Attempt to de-reference a null object
2019-04-19 08:12:06: 	StackTrace: Class.CMT_MetadataAPI.MetadataCallBack.handleResult: line 179, column 1
Class.CMT_MetadataAPI_TEST.test_cmt_api: line 59, column 1
2019-04-19 08:12:06: Class: CMT_UnitTestData_TEST
2019-04-19 08:12:06: Class: CONV_Account_Conversion_BATCH_TEST
2019-04-19 08:12:06: 	Pass: test2ContactAddresses (1789s)
2019-04-19 08:12:06: 	Pass: testAccountConversion1to1 (29705s)
2019-04-19 08:12:06: 	Pass: testAccountConversionBucket (1388s)
2019-04-19 08:12:06: 	Pass: testContactDisableAddresses (1357s)
2019-04-19 08:12:06: 	Pass: testSettingPrimaryAffiliation (1364s)
2019-04-19 08:12:06: 	Pass: testSingleContactAddress (1105s)
2019-04-19 08:12:06: Class: CONV_Account_Conversion_CTRL_TEST
2019-04-19 08:12:06: 	Pass: testConversionCTRLErrorState (1982s)
2019-04-19 08:12:06: 	Pass: testConversionCtrl (1509s)
2019-04-19 08:12:06: Class: CON_CascadeDeleteLookups_TEST
2019-04-19 08:12:06: 	Pass: testContactCascadeDelete (2107s)
2019-04-19 08:12:06: 	Pass: testContactMergeNoCascade (1921s)
2019-04-19 08:12:06: Class: CON_ChangeAccount_TEST
2019-04-19 08:12:06: 	Pass: testAddressOverride (2193s)
2019-04-19 08:12:06: 	Pass: testGetsDefaultAddressHHToHH (1828s)
2019-04-19 08:12:06: 	Pass: testGetsDefaultAddressHHToOrg (1257s)
2019-04-19 08:12:06: 	Pass: testGetsDefaultAddressOne2OneToOne2One (651s)
2019-04-19 08:12:06: 	Pass: testGetsDefaultAddressOne2OneToOrg (646s)
2019-04-19 08:12:06: 	Pass: testGetsDefaultAddressOrgToHH (1324s)
2019-04-19 08:12:06: 	Pass: testGetsDefaultAddressOrgToOne2One (692s)
2019-04-19 08:12:06: 	Pass: testNamesAndOppsUpdatedHHToHH (2877s)
2019-04-19 08:12:06: 	Pass: testNamesAndOppsUpdatedHHToOrg (1738s)
2019-04-19 08:12:06: 	Pass: testNamesAndOppsUpdatedOne2OneToOne2One (1220s)
2019-04-19 08:12:06: 	Pass: testNamesAndOppsUpdatedOne2OneToOrg (1233s)
2019-04-19 08:12:06: 	Pass: testNamesAndOppsUpdatedOrgToHH (1845s)
2019-04-19 08:12:06: 	Pass: testNamesAndOppsUpdatedOrgToOne2One (1539s)
2019-04-19 08:12:06: Class: CON_ContactMergeTDTM_TEST
2019-04-19 08:12:06: 	Pass: mergeContactsDifferentHHAccount (4511s)
2019-04-19 08:12:06: 	Pass: mergeContactsDifferentHHAccountAddressOverride (1296s)
2019-04-19 08:12:06: 	Pass: mergeContactsDifferentHHAccountManyAffl (2102s)
2019-04-19 08:12:06: 	Pass: mergeContactsSameHHAccount (1493s)
2019-04-19 08:12:06: 	Pass: shouldReturnAccountIdByMasterContactIdWhenAccountsAreIndividualType (14s)
2019-04-19 08:12:06: 	Pass: shouldReturnAccountIdByMasterContactIdWhenContactsAccountsAreIndividualType (12s)
2019-04-19 08:12:06: 	Pass: shouldReturnAccountIdsWhenAccountsAreHouseholds (12s)
2019-04-19 08:12:06: 	Pass: shouldReturnAccountIdsWhenContactsAccountsAreHouseholds (12s)
2019-04-19 08:12:06: 	Pass: shouldReturnEmptyListWhenAccountsAreNotHouseholds (12s)
2019-04-19 08:12:06: 	Pass: shouldReturnEmptyListWhenContactsAccountsAreNotHouseholds (13s)
2019-04-19 08:12:06: 	Pass: shouldReturnEmptyMapWhenAccountsAreIndividualType (11s)
2019-04-19 08:12:06: 	Pass: shouldReturnEmptyMapWhenContactsAccountsAreIndividualType (12s)
2019-04-19 08:12:06: 	Pass: shouldSetMergeKeyIds (11s)
2019-04-19 08:12:06: Class: CON_ContactMergeTDTM_TEST2
2019-04-19 08:12:06: 	Pass: contactMergeShouldRecalculateRollup (21588s)
2019-04-19 08:12:06: 	Pass: mergeContactsDifferentHHAccountManyRel (2525s)
2019-04-19 08:12:06: 	Pass: testNamesAndOppsMergeHHToHH (3984s)
2019-04-19 08:12:06: 	Pass: testNamesAndOppsMergeHHToOrg (2633s)
2019-04-19 08:12:06: 	Pass: testNamesAndOppsMergeOne2OneToOne2One (1964s)
2019-04-19 08:12:06: 	Pass: testNamesAndOppsMergeOne2OneToOrg (1674s)
2019-04-19 08:12:06: 	Pass: testNamesAndOppsMergeOrgToHH (2589s)
2019-04-19 08:12:06: 	Pass: testNamesAndOppsMergeOrgToOne2One (1536s)
2019-04-19 08:12:06: 	Pass: testNamesAndOppsMergeOrgToOrg (1427s)
2019-04-19 08:12:06: Class: CON_ContactMerge_TEST
2019-04-19 08:12:06: 	Pass: exerciseUIHHAccount (1192s)
2019-04-19 08:12:06: 	Pass: exerciseUIOne2One (530s)
2019-04-19 08:12:06: 	Pass: failMergeWithDeletedRecordSelectedHHAccount (960s)
2019-04-19 08:12:06: 	Pass: failMergeWithDeletedRecordSelectedOne2One (613s)
2019-04-19 08:12:06: 	Pass: failNextStepWithDeletedRecordSelectedHHAccount (793s)
2019-04-19 08:12:06: 	Pass: failNextStepWithDeletedRecordSelectedOne2One (603s)
2019-04-19 08:12:06: 	Pass: merge1Org1OneToOneHHAccount (1541s)
2019-04-19 08:12:06: 	Pass: merge1Org1OneToOneOne2One (1439s)
2019-04-19 08:12:06: 	Pass: merge2IndividualsHHAccount (1360s)
2019-04-19 08:12:06: 	Pass: merge2IndividualsOne2One (1042s)
2019-04-19 08:12:06: 	Pass: merge2OneToOneHHAccount (1804s)
2019-04-19 08:12:06: 	Pass: merge2OneToOneOne2One (1495s)
2019-04-19 08:12:06: 	Pass: merge2OneToOneOppsHHAccount (2460s)
2019-04-19 08:12:06: 	Pass: merge2OneToOneOppsOne2One (1902s)
2019-04-19 08:12:06: 	Pass: merge2OrganizationsHHAccount (1074s)
2019-04-19 08:12:06: 	Pass: merge2OrganizationsOne2One (1364s)
2019-04-19 08:12:06: 	Pass: merge2PrivateContactsHHAccount (899s)
2019-04-19 08:12:06: 	Pass: merge2PrivateContactsOne2One (745s)
2019-04-19 08:12:06: 	Pass: tooFewContactsSelectedHHAccount (505s)
2019-04-19 08:12:06: 	Pass: tooFewContactsSelectedOne2One (339s)
2019-04-19 08:12:06: 	Pass: tooManyContactsSelectedHHAccount (615s)
2019-04-19 08:12:06: 	Pass: tooManyContactsSelectedOne2One (425s)
2019-04-19 08:12:06: Class: CON_ContactMerge_TEST2
2019-04-19 08:12:06: 	Pass: ghIssue6HHAccount (2449s)
2019-04-19 08:12:06: 	Pass: ghIssue6One2One (1601s)
2019-04-19 08:12:06: 	Pass: householdDifferentFromMaster (2463s)
2019-04-19 08:12:06: 	Pass: merge2OneToOneInSameAccountHHAccount (1711s)
2019-04-19 08:12:06: 	Pass: merge2OneToOneInSameAccountOne2One (1748s)
2019-04-19 08:12:06: 	Pass: merge3OneToOneHHAccount (3216s)
2019-04-19 08:12:06: 	Pass: merge3OneToOneOne2One (1951s)
2019-04-19 08:12:06: 	Pass: personAccountErrorDetection (32s)
2019-04-19 08:12:06: 	Pass: testBadIdsPassed (335s)
2019-04-19 08:12:06: 	Pass: testGoodIdsPassed (442s)
2019-04-19 08:12:06: 	Pass: testNamesAndOppsMergeBucketToHH (2887s)
2019-04-19 08:12:06: 	Pass: testNamesAndOppsMergeBucketToOne2One (2023s)
2019-04-19 08:12:06: 	Pass: testNamesAndOppsMergeHHToBucket (2569s)
2019-04-19 08:12:06: 	Pass: testNamesAndOppsMergeHHToHH (3186s)
2019-04-19 08:12:06: 	Pass: testNamesAndOppsMergeHHToOne2One (2976s)
2019-04-19 08:12:06: 	Pass: testNamesAndOppsMergeHHToOrg (2554s)
2019-04-19 08:12:06: 	Pass: testNamesAndOppsMergeOne2OneToBucket (2046s)
2019-04-19 08:12:06: 	Pass: testNamesAndOppsMergeOne2OneToHH (3149s)
2019-04-19 08:12:06: 	Pass: testNamesAndOppsMergeOne2OneToOne2One (2193s)
2019-04-19 08:12:06: 	Pass: testNamesAndOppsMergeOne2OneToOrg (2088s)
2019-04-19 08:12:06: 	Pass: testNamesAndOppsMergeOrgToHH (2360s)
2019-04-19 08:12:06: 	Pass: testNamesAndOppsMergeOrgToOne2One (1984s)
2019-04-19 08:12:06: 	Pass: testNamesAndOppsMergeOrgToOrg (1591s)
2019-04-19 08:12:06: 	Pass: testSearchSpecPassed (347s)
2019-04-19 08:12:06: 	Pass: testStandardSetSelected (422s)
2019-04-19 08:12:06: Class: CON_DeleteContactOverride_TEST
2019-04-19 08:12:06: 	Pass: deleteAloneInHousehold (972s)
2019-04-19 08:12:06: 	Pass: deleteOneToOne (497s)
2019-04-19 08:12:06: 	Pass: deleteWithOtherMembers (1028s)
2019-04-19 08:12:06: 	Pass: testAccountDeleteExceptionWithOverride (2753s)
2019-04-19 08:12:06: 	Pass: testContactDeleteExceptionWithOverride (1859s)
2019-04-19 08:12:06: 	Pass: testContactDeleteWithOverride (1530s)
2019-04-19 08:12:06: 	Pass: testDeleteContactAndLeaveEmptyAccount (647s)
2019-04-19 08:12:06: 	Pass: testNavigationParametersAreSetInConstructor (461s)
2019-04-19 08:12:06: 	Pass: testOnCancel (463s)
2019-04-19 08:12:06: 	Pass: testRetUrlForClassicAndLex (700s)
2019-04-19 08:12:06: 	Pass: testRetUrlIsContactHomeIfNotProvided (592s)
2019-04-19 08:12:06: Class: CON_DoNotContact_TEST
2019-04-19 08:12:06: 	Pass: testDeceasedAlone (978s)
2019-04-19 08:12:06: 	Pass: testDeceasedInHousehold (981s)
2019-04-19 08:12:06: 	Pass: testDoNotContact (614s)
2019-04-19 08:12:06: Class: CRLP_ApiService_TEST
2019-04-19 08:12:06: 	Pass: shouldReturnEmptyListWhenCRLPNotEnabled (38s)
2019-04-19 08:12:06: 	Pass: shouldReturnRollupDefinitionsWhenParameterIsValid (246s)
2019-04-19 08:12:06: 	Pass: shouldThrowExceptionWhenParameterIsInvalid (8s)
2019-04-19 08:12:06: Class: CRLP_Batch_Base_TEST
2019-04-19 08:12:06: 	Pass: accountHardCreditRollupChunkModeFirstJobQueryContainsOrderByLimit (295s)
2019-04-19 08:12:06: 	Pass: accountHardCreditRollupChunkModeQueryContainsOrderByLimitId (403s)
2019-04-19 08:12:06: 	Pass: accountHardCreditRollupGeneratesIncrementalModeJoinQuery (107s)
2019-04-19 08:12:06: 	Pass: accountHardCreditRollupGeneratesLastNDaysJoinQuery (98s)
2019-04-19 08:12:06: 	Pass: accountHardCreditRollupGeneratesLastNDaysJoinQueryWithCustomSettingFalse (99s)
2019-04-19 08:12:06: 	Pass: accountHardCreditRollupGeneratesLastNYearsJoinQuery (101s)
2019-04-19 08:12:06: 	Pass: accountHardCreditRollupWithUserDefinedJoinGeneratesProperJoinQuery (133s)
2019-04-19 08:12:06: 	Pass: chunkModeRollupHasAdditionalRecordsToProcess (1060s)
2019-04-19 08:12:06: 	Pass: contactHardCreditRollupChunkModeFirstJobQueryContainsOrderByLimit (394s)
2019-04-19 08:12:06: 	Pass: contactHardCreditRollupChunkModeQueryContainsOrderByLimitId (717s)
2019-04-19 08:12:06: 	Pass: contactHardCreditRollupGeneratesIncrementalModeJoinQuery (128s)
2019-04-19 08:12:06: 	Pass: contactHardCreditRollupGeneratesLastNDaysJoinQuery (135s)
2019-04-19 08:12:06: 	Pass: contactHardCreditRollupGeneratesLastNDaysJoinQueryWithCustomSettingFalse (121s)
2019-04-19 08:12:06: 	Pass: contactHardCreditRollupGeneratesLastNYearsJoinQuery (122s)
2019-04-19 08:12:06: 	Pass: contactHardCreditRollupGeneratesStandardJoinQueryWhenNotScheduledJob (120s)
2019-04-19 08:12:06: 	Pass: contactHardCreditRollupWithUserDefinedJoinGeneratesProperJoinQuery (121s)
2019-04-19 08:12:06: 	Pass: contactSoftCreditRollupChunkModeFirstJobQueryContainsOrderByLimit (129s)
2019-04-19 08:12:06: 	Pass: contactSoftCreditRollupChunkModeQueryContainsOrderByLimitId (392s)
2019-04-19 08:12:06: Class: CRLP_ConfigBuilder_TEST
2019-04-19 08:12:06: 	Fail: test_CMTdeployment (442s)
2019-04-19 08:12:06: 	Message: System.NullPointerException: Attempt to de-reference a null object
2019-04-19 08:12:06: 	StackTrace: Class.CMT_MetadataAPI.MetadataCallBack.handleResult: line 179, column 1
Class.CRLP_ConfigBuilder_TEST.test_CMTdeployment: line 105, column 1
2019-04-19 08:12:06: Class: CRLP_DefaultConfigBuilder_TEST
2019-04-19 08:12:06: 	Pass: test_createDefaults_diffContact (523s)
2019-04-19 08:12:06: 	Pass: test_createDefaults_simple (253s)
2019-04-19 08:12:06: 	Pass: test_createMembershipDefaults_MembershipRecordTypeDoesNotExist (429s)
2019-04-19 08:12:06: 	Pass: test_excludedRecordTypes_RecordTypeDoesNotExist (221s)
2019-04-19 08:12:06: Class: CRLP_FiscalYears_TEST
2019-04-19 08:12:06: 	Pass: testGetFiscalYearForDate (17s)
2019-04-19 08:12:06: 	Pass: yearStringShouldNotIncludePunctuation (565s)
2019-04-19 08:12:06: Class: CRLP_Operation_TEST
2019-04-19 08:12:06: 	Pass: rollupCmtOperationPicklistShouldMatchEnums (19s)
2019-04-19 08:12:06: 	Pass: test_static_methods (14s)
2019-04-19 08:12:06: 	Pass: timeBoundOperationTypePicklistShouldMatchEnums (9s)
2019-04-19 08:12:06: Class: CRLP_Query_SEL_TEST
2019-04-19 08:12:06: 	Pass: test_ResultsQueryBuilder (775s)
2019-04-19 08:12:06: 	Pass: test_buildCommonQueryFilterOnOpportunity_BuildsValidWhereClause (131s)
2019-04-19 08:12:06: 	Pass: test_buildCommonQueryFilterOnOpportunity_NoFilterGroups (59s)
2019-04-19 08:12:06: 	Pass: test_buildCommonQueryFilterOnOpportunity_NoRollups (21s)
2019-04-19 08:12:06: Class: CRLP_RecalculateBTN_TEST
2019-04-19 08:12:06: 	Pass: test_legacy_rollups (1376s)
2019-04-19 08:12:06: 	Pass: test_new_rollups (654s)
2019-04-19 08:12:06: 	Pass: test_nopermissions (425s)
2019-04-19 08:12:06: Class: CRLP_RollupAccSoftCredit_TEST
2019-04-19 08:12:06: 	Pass: test_Rollups_Batch (3573s)
2019-04-19 08:12:06: 	Pass: test_Rollups_SkewBatch (3008s)
2019-04-19 08:12:06: 	Pass: test_Rollups_Trigger (3058s)
2019-04-19 08:12:06: Class: CRLP_RollupAccount_TEST
2019-04-19 08:12:06: 	Pass: test_Rollups_Batch (9900s)
2019-04-19 08:12:06: 	Pass: test_Rollups_MultiCurrencyBatch (10s)
2019-04-19 08:12:06: 	Pass: test_Rollups_Queueable (3669s)
2019-04-19 08:12:06: 	Pass: test_Rollups_ReparentOppAccount (10315s)
2019-04-19 08:12:06: 	Pass: test_Rollups_SkewBatch (4334s)
2019-04-19 08:12:06: 	Pass: test_Rollups_Trigger (6818s)
2019-04-19 08:12:06: Class: CRLP_RollupContact_TEST
2019-04-19 08:12:06: 	Pass: test_Rollups_AlwaysRollupToPrimaryEnabled (5331s)
2019-04-19 08:12:06: 	Pass: test_Rollups_Batch (5225s)
2019-04-19 08:12:06: 	Pass: test_Rollups_Queueable (4925s)
2019-04-19 08:12:06: 	Pass: test_Rollups_SkewBatch (5212s)
2019-04-19 08:12:06: 	Pass: test_Rollups_Trigger (9025s)
2019-04-19 08:12:06: Class: CRLP_RollupGAU_TEST
2019-04-19 08:12:06: 	Pass: test_Rollups_SkewBatch (5176s)
2019-04-19 08:12:06: Class: CRLP_RollupRecurringDonation_TEST
2019-04-19 08:12:06: 	Pass: test_Rollups_Batch (1442s)
2019-04-19 08:12:06: 	Pass: test_Rollups_Queueable (563s)
2019-04-19 08:12:06: 	Pass: test_Rollups_SkewBatch (997s)
2019-04-19 08:12:06: 	Pass: test_Rollups_Trigger (690s)
2019-04-19 08:12:06: Class: CRLP_RollupScheduler_TEST
2019-04-19 08:12:06: 	Pass: test_schedule_CRLPJobs (2592s)
2019-04-19 08:12:06: 	Pass: test_scheduled_jobs (1643s)
2019-04-19 08:12:06: 	Pass: test_skewdispatcher_job (1121s)
2019-04-19 08:12:06: Class: CRLP_RollupSoftCredit_TEST
2019-04-19 08:12:06: 	Pass: test_Rollups_Account (6032s)
2019-04-19 08:12:06: 	Pass: test_Rollups_AlwaysRollupToPrimaryEnabled (5164s)
2019-04-19 08:12:06: 	Pass: test_Rollups_Contact (4619s)
2019-04-19 08:12:06: 	Pass: test_Rollups_ContactSkew (4796s)
2019-04-19 08:12:06: Class: CRLP_RollupUI_TEST
2019-04-19 08:12:06: 	Pass: testGetDeploymentStatus_Rollup (166s)
2019-04-19 08:12:06: 	Pass: testGetFilterGroupDefinitions (20s)
2019-04-19 08:12:06: 	Pass: testGetFilterRuleConstantPicklistOptions (93s)
2019-04-19 08:12:06: 	Pass: testGetRollupDefinitions (33s)
2019-04-19 08:12:06: 	Pass: testSaveFilterGroupAndRules (14s)
2019-04-19 08:12:06: 	Pass: testSaveRollup (20s)
2019-04-19 08:12:06: 	Pass: testSetupFilterGroupDetail (105s)
2019-04-19 08:12:06: 	Pass: testSetupRollupDetail (208s)
2019-04-19 08:12:06: 	Pass: testSetupRollupGrid (52s)
2019-04-19 08:12:06: Class: CRLP_Rollup_SEL_TEST
2019-04-19 08:12:06: 	Pass: shouldMatchUnsupportedOperationsMap (53s)
2019-04-19 08:12:06: 	Pass: shouldReturnExpectedFieldsToQuery (233s)
2019-04-19 08:12:06: 	Pass: shouldReturnExpectedRollupDefinitions (58s)
2019-04-19 08:12:06: 	Pass: shouldValidateFieldDescribes (45s)
2019-04-19 08:12:06: 	Pass: validateRollupSelectorGetterMethodResults (57s)
2019-04-19 08:12:06: Class: CRLP_Rollup_SVC_TEST
2019-04-19 08:12:06: 	Pass: test_get_batch_sizes (534s)
2019-04-19 08:12:06: 	Pass: test_isRecalcNeeded (523s)
2019-04-19 08:12:06: Class: Callable_API_TEST
2019-04-19 08:12:06: 	Pass: callableApiThrowsExceptionWhenActionIsInvalid (16s)
2019-04-19 08:12:06: 	Pass: verifyCallableReturnsAnObject (217s)
2019-04-19 08:12:06: Class: EP_EngagementPlanTaskValidation_TEST
2019-04-19 08:12:06: 	Pass: testCrossTemplateEPDependentTask (371s)
2019-04-19 08:12:06: 	Pass: testMultipleEPDependentTask (322s)
2019-04-19 08:12:06: 	Pass: testRedundantEPDependentTask (310s)
2019-04-19 08:12:06: 	Pass: testSingleEPDependentTask (204s)
2019-04-19 08:12:06: 	Pass: testUpdateCrossTemplateEPDependentTask (273s)
2019-04-19 08:12:06: 	Pass: testUpdateTemplateWithEPDependentTask (267s)
2019-04-19 08:12:06: Class: EP_EngagementPlans_TEST
2019-04-19 08:12:06: 	Pass: testDependentPlan (2952s)
2019-04-19 08:12:06: 	Pass: testPlanUpdate (382s)
2019-04-19 08:12:06: 	Pass: testPlanWithTwoLookups (370s)
2019-04-19 08:12:06: 	Pass: testPlanWithoutLookup (165s)
2019-04-19 08:12:06: 	Pass: testSkipWeekendsFriday (920s)
2019-04-19 08:12:06: 	Pass: testSkipWeekendsMonday (745s)
2019-04-19 08:12:06: 	Pass: testTaskAssignment (422s)
2019-04-19 08:12:06: 	Pass: test_getsobjectparentpath (33s)
2019-04-19 08:12:06: Class: EP_ManageEPTemplate_CTRL_TEST
2019-04-19 08:12:06: 	Pass: testClone (988s)
2019-04-19 08:12:06: 	Pass: testDependentPlan (1026s)
2019-04-19 08:12:06: 	Pass: testResaveSucceedsWhenErrorIsFixed (644s)
2019-04-19 08:12:06: 	Pass: testSaveFailsWhenNewTaskHasNoName (248s)
2019-04-19 08:12:06: 	Pass: testSaveRollsBackAllDmlsOnError (582s)
2019-04-19 08:12:06: Class: EP_TaskDependency_TEST
2019-04-19 08:12:06: 	Pass: testDelayType (1599s)
2019-04-19 08:12:06: 	Pass: testDeleteDependentTask (1127s)
2019-04-19 08:12:06: 	Pass: testDeletedPlan (936s)
2019-04-19 08:12:06: 	Pass: testDependentPlan (1118s)
2019-04-19 08:12:06: Class: EP_TaskRollup_TEST
2019-04-19 08:12:06: 	Pass: testDeleteCompletedEPTask (1744s)
2019-04-19 08:12:06: 	Pass: testMultipleEPTasks (967s)
2019-04-19 08:12:06: 	Pass: testMultipleEPTasksAndPlans (1307s)
2019-04-19 08:12:06: 	Pass: testMultipleTasks (167s)
2019-04-19 08:12:06: 	Pass: testSingleEPTask (669s)
2019-04-19 08:12:06: 	Pass: testSingleTask (137s)
2019-04-19 08:12:06: 	Pass: testUnrelateEPTask (1064s)
2019-04-19 08:12:06: 	Pass: testUpdateMultipleEPTask (1159s)
2019-04-19 08:12:06: Class: ERR_AddError_TEST
2019-04-19 08:12:06: 	Pass: databaseDml (620s)
2019-04-19 08:12:06: Class: ERR_AsyncErrors_TEST
2019-04-19 08:12:06: 	Pass: testInsertsErrors (16s)
2019-04-19 08:12:06: 	Pass: testQueriesForErrorsInCurrentNamespace (10s)
2019-04-19 08:12:06: 	Pass: testQueryForErrorsInLastDayIfNotPreviouslyRun (9s)
2019-04-19 08:12:06: 	Pass: testQueryForErrorsSinceLastRun (49s)
2019-04-19 08:12:06: 	Pass: testSendsNotifications (10s)
2019-04-19 08:12:06: 	Pass: testUpdatesLastRunSetting (10s)
2019-04-19 08:12:06: Class: ERR_ExceptionHandler_TEST
2019-04-19 08:12:06: 	Pass: testHandleException (252s)
2019-04-19 08:12:06: 	Pass: testUnhandledExceptionIsUnmodified (6s)
2019-04-19 08:12:06: Class: ERR_Handler_CTRL_TEST
2019-04-19 08:12:06: Class: ERR_Handler_TEST
2019-04-19 08:12:06: 	Pass: controllerWithManualRollback (1998s)
2019-04-19 08:12:06: 	Pass: errorStoredInDatabaseFromInsert (1092s)
2019-04-19 08:12:06: 	Pass: errorsStoredInDbTdtmCustomConfigEmailErrors (809s)
2019-04-19 08:12:06: 	Pass: errorsStoredInDbTdtmCustomConfigPostToChatter (197s)
2019-04-19 08:12:06: 	Pass: testInactiveUserEmailBehavior (544s)
2019-04-19 08:12:06: Class: ERR_Notifier_TEST
2019-04-19 08:12:06: 	Pass: testGetSystemAdminEmails (72s)
2019-04-19 08:12:06: Class: ERR_ParentAccountUpdater2_TEST
2019-04-19 08:12:06: Class: ERR_ParentAccountUpdater_TEST
2019-04-19 08:12:06: Class: HH_CampaignDedupeBTN_TEST
2019-04-19 08:12:06: 	Pass: testCampaignHHReport (2023s)
2019-04-19 08:12:06: Class: HH_Container_TEST
2019-04-19 08:12:06: 	Pass: saveShouldAddRemovedContactToNewHousehold (2240s)
2019-04-19 08:12:06: 	Pass: saveShouldResultInOneDefaultAddressWhenContactsAreAddedToTheHousehold (3359s)
2019-04-19 08:12:06: 	Pass: testAddContactAddresses (1119s)
2019-04-19 08:12:06: 	Pass: testAutoCompleteDataProvider (1022s)
2019-04-19 08:12:06: 	Pass: testAutoCompleteIsValidSearchQuery (11s)
2019-04-19 08:12:06: 	Pass: testAutoCompleteReturnsEmptyListForEncryptedContactNameAndInvalidSearchQuery (859s)
2019-04-19 08:12:06: 	Pass: testAutoCompleteReturnsRecordsForEncryptedContactNameAndValidSearchQuery (949s)
2019-04-19 08:12:06: 	Pass: testContactSoqlIsCorrect (621s)
2019-04-19 08:12:06: 	Pass: testContactsAreReturnedWhenHHNamingSettingsIsInvalidAndAutomaticHHNamingIsOff (972s)
2019-04-19 08:12:06: 	Pass: testGetAddresses (987s)
2019-04-19 08:12:06: 	Pass: testGetContactFieldsReturnsExpectedFieldNames (22s)
2019-04-19 08:12:06: 	Pass: testGetHHGetContacts (908s)
2019-04-19 08:12:06: 	Pass: testGetSalutations (18s)
2019-04-19 08:12:06: 	Pass: testHHNameAndGreetingsAreModifiedWhenAutomaticHHNamingIsOn (961s)
2019-04-19 08:12:06: 	Pass: testHHNameAndGreetingsAreNotModifiedWhenAutomaticHHNamingIsOff (900s)
2019-04-19 08:12:06: 	Pass: testMergeHouseholds (1909s)
2019-04-19 08:12:06: 	Pass: testPackageLabels (16s)
2019-04-19 08:12:06: 	Pass: testUpdateHousehold (1332s)
2019-04-19 08:12:06: 	Pass: testUpsertContacts (1415s)
2019-04-19 08:12:06: 	Pass: testUpsertContactsRollsBackAllDmlsOnError (1215s)
2019-04-19 08:12:06: Class: HH_HouseholdNamingSettingValidator_TEST
2019-04-19 08:12:06: 	Pass: testErrorWhenClassDoesNotExist (48s)
2019-04-19 08:12:06: 	Pass: testErrorWhenClassDoesNotImplementINamingInterface (16s)
2019-04-19 08:12:06: 	Pass: testErrorWhenFormalGreetingFormatIsInvalid (82s)
2019-04-19 08:12:06: 	Pass: testErrorWhenHHNameFormatIsInvalid (39s)
2019-04-19 08:12:06: 	Pass: testErrorWhenInformalGreetingFormatIsInvalid (39s)
2019-04-19 08:12:06: 	Pass: testErrorsWhenAllFormatFieldsAreInvalid (47s)
2019-04-19 08:12:06: 	Pass: testInvalidClassErrorWhenClassAndFormatFieldsAreInvalid (21s)
2019-04-19 08:12:06: 	Pass: testSuccessWhenAllHHSettingsFieldsAreValid (36s)
2019-04-19 08:12:06: 	Pass: testSuccessWhenClassImplementsINamingInterface (15s)
2019-04-19 08:12:06: 	Pass: testSuccessWhenClassIsNotSpecified (14s)
2019-04-19 08:12:06: 	Pass: testSuccessWhenFormatFieldIsNull (34s)
2019-04-19 08:12:06: Class: HH_HouseholdNaming_TEST
2019-04-19 08:12:06: 	Pass: HouseholdNamingTest (2437s)
2019-04-19 08:12:06: 	Pass: HouseholdNamingUpdateTest (2415s)
2019-04-19 08:12:06: 	Pass: testBatch (723s)
2019-04-19 08:12:06: 	Pass: testCaseChanges (546s)
2019-04-19 08:12:06: 	Pass: testGetHouseholdContactsReturnsDataForSpecifiedHHOnly (577s)
2019-04-19 08:12:06: 	Pass: testGetHouseholdContactsReturnsEmptyList (220s)
2019-04-19 08:12:06: 	Pass: testIsAutomaticNamingReturnsFalseWhenAutomaticHHNamingIsOff (12s)
2019-04-19 08:12:06: 	Pass: testIsAutomaticNamingReturnsTrueWhenAutomaticHHNamingIsOn (11s)
2019-04-19 08:12:06: 	Pass: testNamingOrder (1946s)
2019-04-19 08:12:06: 	Pass: testNamingOrder2 (807s)
2019-04-19 08:12:06: 	Pass: testNoFieldIsReturnedWhenAutomaticHHNamingIsOff (13s)
2019-04-19 08:12:06: 	Pass: testReturnedFieldsWhenAutomaticHHNamingIsOn (16s)
2019-04-19 08:12:06: 	Pass: testSoqlContainsHHNamingFieldsWhenAutomaticHHNamingIsOn (22s)
2019-04-19 08:12:06: 	Pass: testSoqlDoesNotContainHHNamingFieldsWhenAutomaticHHNamingIsOff (18s)
2019-04-19 08:12:06: 	Pass: testUpdateNamesIsAppliedToSpecifiedHHsOnly (530s)
2019-04-19 08:12:06: Class: HH_Households_TEST
2019-04-19 08:12:06: 	Pass: Households_Test (11s)
2019-04-19 08:12:06: 	Pass: contactDeleteWithOwnHousehold (1070s)
2019-04-19 08:12:06: 	Pass: contactDeleteWithSharedHousehold (1185s)
2019-04-19 08:12:06: 	Pass: deleteEmptyHouseholds_test (968s)
2019-04-19 08:12:06: 	Pass: newIndContactAllContactsProcessor (991s)
2019-04-19 08:12:06: 	Pass: newIndContactIndividualsProcessor (1008s)
2019-04-19 08:12:06: 	Pass: newNoHouseholdProcessor (356s)
2019-04-19 08:12:06: 	Pass: newOrgContactAllContactsProcessor (1022s)
2019-04-19 08:12:06: 	Pass: newOrgContactIndividualsProcessor (406s)
2019-04-19 08:12:06: 	Pass: newPrivateContactAllContactsProcessor (1014s)
2019-04-19 08:12:06: 	Pass: testBulk (19926s)
2019-04-19 08:12:06: 	Pass: testCaseChanges (753s)
2019-04-19 08:12:06: 	Pass: testContactDmlWhenAutomaticHHNamingIsOff (663s)
2019-04-19 08:12:06: 	Pass: testHouseholdExclusion (669s)
2019-04-19 08:12:06: 	Pass: testMergeRollupSupport (1075s)
2019-04-19 08:12:06: 	Pass: testNewAndUpdateContactWithHHNaming (756s)
2019-04-19 08:12:06: Class: HH_ManageHH_TEST
2019-04-19 08:12:06: 	Pass: testExistingHHAccount (502s)
2019-04-19 08:12:06: 	Pass: testExistingHHObject (237s)
2019-04-19 08:12:06: 	Pass: testNewHHObject (716s)
2019-04-19 08:12:06: Class: HH_NameSpec_TEST
2019-04-19 08:12:06: 	Pass: OneAnonymousContact (23s)
2019-04-19 08:12:06: 	Pass: OneContact (19s)
2019-04-19 08:12:06: 	Pass: OneContactXReferences (807s)
2019-04-19 08:12:06: 	Pass: SixContactsOneLastnamesContactOverrun (31s)
2019-04-19 08:12:06: 	Pass: SixContactsTwoLastnamesContactOverrun (51s)
2019-04-19 08:12:06: 	Pass: ThreeContactsTwoLastNamesNotInSequenceWhenTheNameFormatHasLastName (28s)
2019-04-19 08:12:06: 	Pass: ThreeContactsTwoLastNamesNotInSequenceWhenTheNameFormatHasNoLastName (22s)
2019-04-19 08:12:06: 	Pass: ThreeContactsTwoLastnames (25s)
2019-04-19 08:12:06: 	Pass: ThreeContactsTwoLastnamesCustomFields (26s)
2019-04-19 08:12:06: 	Pass: TwoContactDifferentLastname (18s)
2019-04-19 08:12:06: 	Pass: TwoContactSameLastname (21s)
2019-04-19 08:12:06: 	Pass: TwoContactSameLastnameAccountReference (19s)
2019-04-19 08:12:06: 	Pass: testHHNamingWhenContactFieldNamesAreCaseInsensitive (19s)
2019-04-19 08:12:06: 	Pass: testRefreshAllHHNaming (1657s)
2019-04-19 08:12:06: 	Pass: testRefreshAllHHNamingManyHH (12216s)
2019-04-19 08:12:06: 	Pass: testRefreshAllHHNamingWithCustom (1247s)
2019-04-19 08:12:06: Class: HH_OppContactRoles_TEST
2019-04-19 08:12:06: 	Pass: ghIssue25 (981s)
2019-04-19 08:12:06: 	Pass: opportunityDeceasedPrimaryAccount (1138s)
2019-04-19 08:12:06: 	Pass: opportunityRegularAccountHHAccount (753s)
2019-04-19 08:12:06: 	Pass: opportunityRegularAccountOne2One (671s)
2019-04-19 08:12:06: 	Pass: opportunityWithHouseholdBucket (993s)
2019-04-19 08:12:06: 	Pass: opportunityWithHouseholdHHAccount (1603s)
2019-04-19 08:12:06: 	Pass: opportunityWithHouseholdNoRolesBucket (747s)
2019-04-19 08:12:06: 	Pass: opportunityWithHouseholdNoRolesHHAccount (1144s)
2019-04-19 08:12:06: 	Pass: opportunityWithHouseholdNoRolesOne2One (1073s)
2019-04-19 08:12:06: 	Pass: opportunityWithHouseholdOne2One (1530s)
2019-04-19 08:12:06: 	Pass: opportunityWithNoHouseholdHHAccount (901s)
2019-04-19 08:12:06: 	Pass: opportunityWithNoHouseholdOne2One (764s)
2019-04-19 08:12:06: 	Pass: shouldNotCreateOcrsWhenOppDisableContactRoleAutomationIsChecked (1460s)
2019-04-19 08:12:06: 	Pass: testOppsAcctChangeHHToHH (1996s)
2019-04-19 08:12:06: 	Pass: testOppsAcctChangeHHToOrg (1414s)
2019-04-19 08:12:06: 	Pass: testOppsAcctChangeOne2OneToOne2One (1151s)
2019-04-19 08:12:06: 	Pass: testOppsAcctChangeOne2OneToOrg (1173s)
2019-04-19 08:12:06: 	Pass: testOppsAcctChangeOrgToHH (1384s)
2019-04-19 08:12:06: 	Pass: testOppsAcctChangeOrgToOne2One (1035s)
2019-04-19 08:12:06: 	Pass: updateOppHHAccountRefreshNone (2510s)
2019-04-19 08:12:06: 	Pass: updateOppHHAccountRefreshOpen (2261s)
2019-04-19 08:12:06: 	Pass: updateOppHHAccountRefreshOpenAndClosed (2294s)
2019-04-19 08:12:06: Class: LD_LeadConvertOverride_TEST
2019-04-19 08:12:06: 	Pass: accFinderBuildsCorrectSearchQuery (1011s)
2019-04-19 08:12:06: 	Pass: contactFinderBuildsCorrectSOQLQuery (774s)
2019-04-19 08:12:06: 	Pass: contactFinderBuildsCorrectSearchQuery (469s)
2019-04-19 08:12:06: 	Pass: convertCompanyLead_Test (731s)
2019-04-19 08:12:06: 	Pass: mergeLeadConversion_TestBucketAccountOppOCR (951s)
2019-04-19 08:12:06: 	Pass: mergeLeadConversion_TestHHAccountOppOCR (1157s)
2019-04-19 08:12:06: 	Pass: mergeLeadConversion_TestOne2OneOppOCR (917s)
2019-04-19 08:12:06: 	Pass: newLeadConversionExistingNamedCompanyAffl_TestBucketAccount (785s)
2019-04-19 08:12:06: 	Pass: newLeadConversionExistingNamedCompanyAffl_TestHHAccount (1143s)
2019-04-19 08:12:06: 	Pass: newLeadConversionExistingNamedCompanyAffl_TestOne2One (800s)
2019-04-19 08:12:06: 	Pass: newLeadConversionExistingNamedCompany_TestBucketAccount (1033s)
2019-04-19 08:12:06: 	Pass: newLeadConversionExistingNamedCompany_TestHHAccount (694s)
2019-04-19 08:12:06: 	Pass: newLeadConversionExistingNamedCompany_TestOne2One (649s)
2019-04-19 08:12:06: 	Pass: newLeadConversionHHObjBucket (856s)
2019-04-19 08:12:06: 	Pass: newLeadConversionHHObjOne2One (949s)
2019-04-19 08:12:06: 	Pass: newLeadConversionMerge_TestBucketAccount (691s)
2019-04-19 08:12:06: 	Pass: newLeadConversionMerge_TestHHAccount (871s)
2019-04-19 08:12:06: 	Pass: newLeadConversionMerge_TestOne2One (708s)
2019-04-19 08:12:06: 	Pass: newLeadConversionNewNamedCompany_TestBucketAccount (656s)
2019-04-19 08:12:06: 	Pass: newLeadConversionNewNamedCompany_TestHHAccount (631s)
2019-04-19 08:12:06: 	Pass: newLeadConversionNewNamedCompany_TestOne2One (696s)
2019-04-19 08:12:06: 	Pass: newLeadConversion_TestBucketAccount (530s)
2019-04-19 08:12:06: 	Pass: newLeadConversion_TestBucketAccountOppAFF (1014s)
2019-04-19 08:12:06: 	Pass: newLeadConversion_TestBucketAccountOppOCR (713s)
2019-04-19 08:12:06: 	Pass: newLeadConversion_TestHHAccount (893s)
2019-04-19 08:12:06: 	Pass: newLeadConversion_TestHHAccountOppAFF (1377s)
2019-04-19 08:12:06: 	Pass: newLeadConversion_TestHHAccountOppOCR (1072s)
2019-04-19 08:12:06: 	Pass: newLeadConversion_TestOne2One (947s)
2019-04-19 08:12:06: 	Pass: newLeadConversion_TestOne2OneOppAFF (1147s)
2019-04-19 08:12:06: 	Pass: newLeadConversion_TestOne2OneOppOCR (840s)
2019-04-19 08:12:06: 	Pass: newNativeLeadConversion_TestBucketAccount (716s)
2019-04-19 08:12:06: 	Pass: newNativeLeadConversion_TestHHAccount (1099s)
2019-04-19 08:12:06: 	Pass: newNativeLeadConversion_TestOne2One (832s)
2019-04-19 08:12:06: Class: LVL_LevelAssignBATCH_TEST
2019-04-19 08:12:06: 	Pass: ladderConstructorShouldSetTarget (51s)
2019-04-19 08:12:06: 	Pass: previousLevelShouldBePopulatedWhenCurrentLevelIsChangedToBlank (55752s)
2019-04-19 08:12:06: 	Pass: previousLevelShouldNotChangeWhenCurrentLevelDoesNotChange (859s)
2019-04-19 08:12:06: 	Pass: shouldBuildQueryForLevel (17s)
2019-04-19 08:12:06: 	Pass: shouldBuildQueryWithLastRunFilter (48s)
2019-04-19 08:12:06: 	Pass: shouldExcludeFilterWhenAnyLevelIsUpdatedAfterLastRun (154s)
2019-04-19 08:12:06: 	Pass: shouldExcludeFilterWhenSourceIsFormula (13s)
2019-04-19 08:12:06: 	Pass: testAccountLevels (2109s)
2019-04-19 08:12:06: 	Pass: testContactLevels (1720s)
2019-04-19 08:12:06: 	Pass: testContactLevelsChange (1489s)
2019-04-19 08:12:06: 	Pass: testLevelAssignScheduling (1885s)
2019-04-19 08:12:06: 	Pass: testLevelValidationExistingMax (209s)
2019-04-19 08:12:06: 	Pass: testLevelValidationExistingMin (177s)
2019-04-19 08:12:06: 	Pass: testLevelValidationExistingNames (216s)
2019-04-19 08:12:06: 	Pass: testLevelValidationMinMaxMustExist (131s)
2019-04-19 08:12:06: 	Pass: testLevelValidationMinMaxOverlap (157s)
2019-04-19 08:12:06: 	Pass: testLevelValidationNewMax (138s)
2019-04-19 08:12:06: 	Pass: testLevelValidationNewMin (145s)
2019-04-19 08:12:06: 	Pass: testLevelValidationNewNames (144s)
2019-04-19 08:12:06: Class: LVL_LevelEdit_TEST
2019-04-19 08:12:06: 	Pass: testCloneLevel (387s)
2019-04-19 08:12:06: 	Pass: testNewLevel (141s)
2019-04-19 08:12:06: 	Pass: testSaveAndNewLevel (170s)
2019-04-19 08:12:06: 	Pass: testTargetFieldChange (167s)
2019-04-19 08:12:06: Class: MTCH_FindGifts_TEST
2019-04-19 08:12:06: 	Pass: testCreateMatches (3097s)
2019-04-19 08:12:06: 	Pass: testCreateMatchesPercent (2514s)
2019-04-19 08:12:06: 	Pass: testCreateSearchedMatches (2505s)
2019-04-19 08:12:06: 	Pass: testSaveAndCloseRollsBackAllDmlsOnError (2824s)
2019-04-19 08:12:06: 	Pass: testUnmatchMatches (2815s)
2019-04-19 08:12:06: Class: MTCH_Opportunity_TEST
2019-04-19 08:12:06: 	Pass: testCreateMatches (2847s)
2019-04-19 08:12:06: Class: OPP_AutomatedSoftCreditsService_TEST
2019-04-19 08:12:06: 	Pass: testBuildAffiliationOCRs (95s)
2019-04-19 08:12:06: 	Pass: testBuildRelationshipOCRs (139s)
2019-04-19 08:12:06: 	Pass: testCreateAffiliationOCRs (39s)
2019-04-19 08:12:06: 	Pass: testCreateRelationshipOCRs (22s)
2019-04-19 08:12:06: 	Pass: testIsDuplicateOCR (50s)
2019-04-19 08:12:06: 	Pass: testIsNotDuplicateOCR (136s)
2019-04-19 08:12:06: 	Pass: testOpportunityAccountClassificationIsIndividual (85s)
2019-04-19 08:12:06: 	Pass: testOpportunityAccountClassificationIsOrganization (74s)
2019-04-19 08:12:06: 	Pass: testRemoveDuplicateAssociatedRecordsForAffiliations (77s)
2019-04-19 08:12:06: 	Pass: testRemoveDuplicateAssociatedRecordsForRelationships (152s)
2019-04-19 08:12:06: 	Pass: testRetrieveAffiliations (25s)
2019-04-19 08:12:06: 	Pass: testRetrieveOpportunityContactRoles (35s)
2019-04-19 08:12:06: 	Pass: testRetrieveRelationships (35s)
2019-04-19 08:12:06: Class: OPP_CampaignMember_TEST
2019-04-19 08:12:06: 	Pass: batchCreateMixedMembers (10272s)
2019-04-19 08:12:06: 	Pass: createMemberNonResponded (777s)
2019-04-19 08:12:06: 	Pass: createMemberResponded (948s)
2019-04-19 08:12:06: 	Pass: featureOff (875s)
2019-04-19 08:12:06: 	Pass: newMemberCreateStatus (979s)
2019-04-19 08:12:06: 	Pass: omitCampaignMember (845s)
2019-04-19 08:12:06: 	Pass: settingUsesExistingStatus (898s)
2019-04-19 08:12:06: 	Pass: updateMemberCreateStatus (990s)
2019-04-19 08:12:06: 	Pass: updateStatus (987s)
2019-04-19 08:12:06: Class: OPP_CascadeDeleteLookups_TEST
2019-04-19 08:12:06: 	Pass: testOppCascade (2155s)
2019-04-19 08:12:06: 	Pass: testOppCascadeWithPaymentAllocations (1513s)
2019-04-19 08:12:06: Class: OPP_CurrencySync_TEST
2019-04-19 08:12:06: 	Pass: testCurrencyCodeSync (7s)
2019-04-19 08:12:06: Class: OPP_MatchingDonationsBTN_TEST
2019-04-19 08:12:06: 	Pass: TestMatchingDonationPage (1116s)
2019-04-19 08:12:06: Class: OPP_OpportunityContactRoles_TEST
2019-04-19 08:12:06: 	Pass: avoidDuplicateCRs (1129s)
2019-04-19 08:12:06: 	Pass: createOrUpdateCRForIndividualAccount (535s)
2019-04-19 08:12:06: 	Pass: honoreeNotificationBlankSettings (753s)
2019-04-19 08:12:06: 	Pass: honoreeNotificationInsert (701s)
2019-04-19 08:12:06: 	Pass: honoreeNotificationUpdate (972s)
2019-04-19 08:12:06: 	Pass: oppCRTriggerTurnedOff (433s)
2019-04-19 08:12:06: 	Pass: oppRolesForBadId (113s)
2019-04-19 08:12:06: 	Pass: oppRolesForIndividualAccount (356s)
2019-04-19 08:12:06: 	Pass: oppRolesForIndividualContact (534s)
2019-04-19 08:12:06: 	Pass: oppRolesForOneToOneAccount (403s)
2019-04-19 08:12:06: 	Pass: oppRolesForOneToOneContact (426s)
2019-04-19 08:12:06: 	Pass: shouldAutomateSoftCreditOcrsOnlyForOppsWithDisableContactRoleAutomationIsUnchecked (1370s)
2019-04-19 08:12:06: 	Pass: shouldNotCreateAffiliationOcrsWhenOppDisableContactRoleAutomationIsChecked (1130s)
2019-04-19 08:12:06: 	Pass: shouldNotCreateOcrsOnOppInsertWhenDisableContactRoleAutomationIsChecked (1026s)
2019-04-19 08:12:06: 	Pass: shouldNotCreatePrimaryOcrOnOppUpdateWhenDisableContactRoleAutomationIsChecked (900s)
2019-04-19 08:12:06: 	Pass: shouldNotCreateRelationshipOcrsWhenOppDisableContactRoleAutomationIsChecked (2319s)
2019-04-19 08:12:06: 	Pass: shouldNotUpdateOcrOnOppUpdateWhenDisableContactRoleAutomationIsChecked (860s)
2019-04-19 08:12:06: 	Pass: testClearOCRs (1240s)
2019-04-19 08:12:06: 	Pass: testCreateUpdateCRForOrganizationalAccount (492s)
2019-04-19 08:12:06: 	Pass: testOppAccountIdChanges (920s)
2019-04-19 08:12:06: 	Pass: testPopulateAccountDetails (1505s)
2019-04-19 08:12:06: 	Pass: testPopulateAccountToOpportunities (1395s)
2019-04-19 08:12:06: 	Pass: testPopulatePrimaryContactToOpportunities (1248s)
2019-04-19 08:12:06: 	Pass: testPopulateTransactionOCRs (1225s)
2019-04-19 08:12:06: 	Pass: testUpdatingPrimaryContact (942s)
2019-04-19 08:12:06: Class: OPP_OpportunityNaming_BATCH_TEST
2019-04-19 08:12:06: 	Pass: shouldChainNextBatchOffsetByLastRecordProcessed (503s)
2019-04-19 08:12:06: 	Pass: shouldLimitQuery (38s)
2019-04-19 08:12:06: 	Pass: shouldNotChainNextBatchIfLastOppIdProcessedIsNull (17s)
2019-04-19 08:12:06: 	Pass: shouldNotChainNextBatchIfThereAreNoMoreRecordsToProcess (26s)
2019-04-19 08:12:06: 	Pass: shouldQueryAllOpportunitiesInIdOrder (79s)
2019-04-19 08:12:06: 	Pass: shouldQueryOffsetOpportunitiesWhenGivenId (45s)
2019-04-19 08:12:06: 	Pass: shouldRenameOpportunitiesInChunks (460s)
2019-04-19 08:12:06: 	Pass: shouldTrackLastOpportunityIdProcessed (209s)
2019-04-19 08:12:06: Class: OPP_OpportunityNaming_TEST
2019-04-19 08:12:06: 	Pass: testBulk (2312s)
2019-04-19 08:12:06: 	Pass: testButton (949s)
2019-04-19 08:12:06: 	Pass: testException (872s)
2019-04-19 08:12:06: 	Pass: testMissingData (847s)
2019-04-19 08:12:06: Class: OPP_PrimaryContactRoleMerge_TEST
2019-04-19 08:12:06: 	Pass: shouldRemoveDuplicatePrimaryOcrsWhenOppDisableContactRoleAutomationIsChecked (1022s)
2019-04-19 08:12:06: 	Pass: test_NonOrganizational_DeleteBlankAndNonNPSPRole (526s)
2019-04-19 08:12:06: 	Pass: test_NonOrganizational_LogErrorIf_NoPrimaryOCRsWithRoleDefinedInNPSPSettings (433s)
2019-04-19 08:12:06: 	Pass: test_Organization_LogErrorIf_NoPrimaryOCRsWithRoleDefinedInNPSPSettings (453s)
2019-04-19 08:12:06: 	Pass: test_Organizational_DeleteBlankAndNonNPSPRole (513s)
2019-04-19 08:12:06: Class: OPP_PrimaryContact_TEST
2019-04-19 08:12:06: 	Pass: shouldCreateOCRsOnBulkOppInsert (6419s)
2019-04-19 08:12:06: 	Pass: shouldRecreateOCRsWhenPrimaryContactFieldOnOppIsUpdated (1038s)
2019-04-19 08:12:06: 	Pass: shouldUpdateCreateOrDeleteOCRsBasedPrimaryContactFieldOnOppChange (1117s)
2019-04-19 08:12:06: 	Pass: shouldUpdatePrimaryContactOnOppBasedOnPrimaryOCRContact (1213s)
2019-04-19 08:12:06: Class: OPP_SendAcknowledgmentBTN_TEST
2019-04-19 08:12:06: 	Pass: shouldDisplayErrorWhenNoOppSelected (44s)
2019-04-19 08:12:06: 	Pass: shouldNotSendAckWhenAlreadySent (2973s)
2019-04-19 08:12:06: 	Pass: testSendAcknowledgment (732s)
2019-04-19 08:12:06: 	Pass: testSendAcknowledgmentRollsBackAllDmlsOnError (829s)
2019-04-19 08:12:06: Class: OPP_StageMappingUtil_TEST
2019-04-19 08:12:06: 	Pass: testCallableAPISupport (1284s)
2019-04-19 08:12:06: 	Pass: testdetermineOppStateFromOppStageWithSettingsMethod (7s)
2019-04-19 08:12:06: Class: PMT_CascadeDeleteLookups_TEST
2019-04-19 08:12:06: 	Pass: testPaymentCascade (2115s)
2019-04-19 08:12:06: Class: PMT_PaymentCreator_TEST
2019-04-19 08:12:06: 	Pass: CloseLostOppWithMixOfPayments (1443s)
2019-04-19 08:12:06: 	Pass: createOppWithRecordTypeExcluded (294s)
2019-04-19 08:12:06: 	Pass: createOppWithTypeExcluded (285s)
2019-04-19 08:12:06: 	Pass: createOppWithTypeNotExcluded (432s)
2019-04-19 08:12:06: 	Pass: nullAmount (506s)
2019-04-19 08:12:06: 	Pass: testBatchPaymentCreation (675s)
2019-04-19 08:12:06: 	Pass: testClosedLostOpportunity_UpdateAmountFromNullToValue (3433s)
2019-04-19 08:12:06: 	Pass: testClosedLostOpportunity_UpdateAmountFromZeroToValue (3166s)
2019-04-19 08:12:06: 	Pass: testClosedWonOpportunity_UpdateAmountFromNullToValue (4656s)
2019-04-19 08:12:06: 	Pass: testClosedWonOpportunity_UpdateAmountFromZeroToValue (4651s)
2019-04-19 08:12:06: 	Pass: testOpenOpportunity_UpdateAmountFromNullToValue (4784s)
2019-04-19 08:12:06: 	Pass: testOpenOpportunity_UpdateAmountFromZeroToValue (4702s)
2019-04-19 08:12:06: 	Pass: testOpportunityAutoClosingWithMulticurrency (11s)
2019-04-19 08:12:06: 	Pass: testOpportunityAutoClosingWithoutMulticurrency (541s)
2019-04-19 08:12:06: 	Pass: testOpportunityWillAutoCloseIfAmountUpdatedToMatchPayments (673s)
2019-04-19 08:12:06: 	Pass: testOpportunityWillAutoClosefterAllPaymentsReceived (356s)
2019-04-19 08:12:06: 	Pass: testOpportunityWillNotAutoCloseClosesIfAmountSetToZero (480s)
2019-04-19 08:12:06: 	Pass: testOpportunityWillNotAutoCloseIfAllPaymentsWrittenOff (360s)
2019-04-19 08:12:06: 	Pass: testOpportunityWillNotAutoCloseIfAlreadyClosed (684s)
2019-04-19 08:12:06: 	Pass: testOpportunityWillNotAutoCloseIfNoStageNameSet (361s)
2019-04-19 08:12:06: 	Pass: testOpportunityWillNotAutoCloseIfNotAllPaymentsReceived (618s)
2019-04-19 08:12:06: Class: PMT_PaymentWizard_TEST
2019-04-19 08:12:06: 	Pass: testNoAccessMessageIsDisplayedWhenCreatePaymentByUserWithoutAccessOnPayments (965s)
2019-04-19 08:12:06: 	Pass: testNoAccessMessageIsDisplayedWhenWriteoffByUserWithoutAccessOnPayments (658s)
2019-04-19 08:12:06: 	Pass: testOppNotFoundMessageWhenOppIdDoesNotExist (29s)
2019-04-19 08:12:06: 	Pass: testOppNotFoundMessageWhenTypePageParamIsInvalid (392s)
2019-04-19 08:12:06: 	Pass: testOppNotFoundMessageWhenTypePageParamIsInvalidAndUserHasNoAccessOnPayments (543s)
2019-04-19 08:12:06: 	Pass: testPageElementsMonthly (894s)
2019-04-19 08:12:06: 	Pass: testPageElementsWeekly (607s)
2019-04-19 08:12:06: 	Pass: testPageElementsYearly (612s)
2019-04-19 08:12:06: 	Pass: testPaymentMappingsApplied (858s)
2019-04-19 08:12:06: 	Pass: testPaymentsEnabledWhenWriteOff (1022s)
2019-04-19 08:12:06: 	Pass: testPublicGetters (20s)
2019-04-19 08:12:06: 	Pass: testRemovePaidPayments (937s)
2019-04-19 08:12:06: Class: PMT_Payment_TEST
2019-04-19 08:12:06: 	Pass: testOpportunityWillAutoCloseWithACMEnabled (625s)
2019-04-19 08:12:06: 	Pass: test_BlockPaymentCurrencyChange (10s)
2019-04-19 08:12:06: 	Pass: test_UpdatePaymentCurrencyFromOpportunity (9s)
2019-04-19 08:12:06: 	Pass: test_newPaymentCurrencyMatchesOpportunity (9s)
2019-04-19 08:12:06: Class: PSC_ManageSoftCredits_TEST
2019-04-19 08:12:06: 	Pass: createNewPSCs (1897s)
2019-04-19 08:12:06: 	Pass: createNewPSCsByPercent (1388s)
2019-04-19 08:12:06: 	Pass: createNewPSCsToExistingPSCs (1519s)
2019-04-19 08:12:06: 	Pass: deleteExistingPSCs (2286s)
2019-04-19 08:12:06: 	Pass: loadInvalidPSCs (1699s)
2019-04-19 08:12:06: 	Pass: loadSoftCreditOCRs (1611s)
2019-04-19 08:12:06: 	Pass: makeExistingPSCsFullCredits (1879s)
2019-04-19 08:12:06: 	Pass: makeNewPSCsFullCredits (1484s)
2019-04-19 08:12:06: 	Pass: shouldDisplayMessageWhenUserDoesNotHavePermissions (2202s)
2019-04-19 08:12:06: 	Pass: testErrors (1649s)
2019-04-19 08:12:06: 	Pass: testNoSoftCreditRoles (1301s)
2019-04-19 08:12:06: 	Pass: testResaveSucceedsWhenErrorIsFixed (1523s)
2019-04-19 08:12:06: 	Pass: testSaveRollsBackAllDmlsOnError (1412s)
2019-04-19 08:12:06: 	Pass: updateExistingPSCs (1538s)
2019-04-19 08:12:06: 	Pass: verifyEmptyContactRecordsAreNotSaved (1393s)
2019-04-19 08:12:06: Class: PSC_PartialSoftCredit_TEST
2019-04-19 08:12:06: 	Pass: createDupePSCsNewOCRs (1974s)
2019-04-19 08:12:06: 	Pass: createPSCsExistingOCRs (4020s)
2019-04-19 08:12:06: 	Pass: createPSCsNewOCRs (2200s)
2019-04-19 08:12:06: 	Pass: createPSCsSomeExistingOCRs (2419s)
2019-04-19 08:12:06: 	Pass: updatePSCsInvalidFields (2185s)
2019-04-19 08:12:06: 	Pass: updatePSCsRoleName (4899s)
2019-04-19 08:12:06: Class: RD_BulkTests_TEST
2019-04-19 08:12:06: 	Pass: bulkInsertOpportunities (11128s)
2019-04-19 08:12:06: Class: RD_CascadeDeleteLookups_TEST
2019-04-19 08:12:06: 	Pass: testRDCascade (1140s)
2019-04-19 08:12:06: 	Pass: testRDDeleteException (259s)
2019-04-19 08:12:06: 	Pass: testRDDeleteException_ClassicThemeContext (268s)
2019-04-19 08:12:06: 	Pass: testRDDeleteException_LightningThemeContext (335s)
2019-04-19 08:12:06: 	Pass: testRDDeleteWithMixExceptionAndSuccess (907s)
2019-04-19 08:12:06: Class: RD_RecurringDonations_TEST
2019-04-19 08:12:06: 	Pass: closeOppForOpenEndedRecurringDonationCustomDays (1578s)
2019-04-19 08:12:06: 	Pass: closeOppForOpenEndedRecurringDonationCustomMonths (1133s)
2019-04-19 08:12:06: 	Pass: closeOppForOpenEndedRecurringDonationCustomWeeks (1415s)
2019-04-19 08:12:06: 	Pass: closeOppForOpenEndedRecurringDonationCustomYears (894s)
2019-04-19 08:12:06: 	Pass: closeOppForOpenEndedRecurringDonationMonthly (978s)
2019-04-19 08:12:06: 	Pass: closeOppForOpenEndedRecurringDonationQuarterly (1047s)
2019-04-19 08:12:06: 	Pass: closeOppForOpenEndedRecurringDonationWeekly (2021s)
2019-04-19 08:12:06: 	Pass: contactRolesOnOppsBucket (591s)
2019-04-19 08:12:06: 	Pass: contactRolesOnOppsHHAccount (785s)
2019-04-19 08:12:06: 	Pass: contactRolesOnOppsOne2One (648s)
2019-04-19 08:12:06: 	Pass: deleteRecurringDonation (1121s)
2019-04-19 08:12:06: 	Pass: insertCampaignOpportunities (749s)
2019-04-19 08:12:06: 	Pass: insertOpenEndedRecurringDonations (3598s)
2019-04-19 08:12:06: 	Pass: insertOpportunities (758s)
2019-04-19 08:12:06: 	Pass: insertQuarterlyOpportunities (623s)
2019-04-19 08:12:06: 	Pass: insertWeeklyOpportunities (623s)
2019-04-19 08:12:06: 	Pass: testOppContactRoleMethod (2160s)
2019-04-19 08:12:06: 	Pass: testSettingsCreation (16s)
2019-04-19 08:12:06: 	Pass: updateOpenEndedRecurringDonation1an15 (1094s)
2019-04-19 08:12:06: 	Pass: updateOpenEndedRecurringDonationMonthly (2651s)
2019-04-19 08:12:06: 	Pass: updateOpenEndedRecurringDonationQuarterly (2472s)
2019-04-19 08:12:06: 	Pass: updateOpenEndedRecurringDonationWeekly (2348s)
2019-04-19 08:12:06: 	Pass: updateOpenEndedRecurringDonationYearly (2374s)
2019-04-19 08:12:06: Class: RD_RecurringDonations_TEST2
2019-04-19 08:12:06: 	Pass: adjustDayOfMonthReturnsDateBasedOnEstablishedDay (89s)
2019-04-19 08:12:06: 	Pass: adjustDayOfMonthReturnsDateBasedOnNextDonationDay (11s)
2019-04-19 08:12:06: 	Pass: adjustDayOfMonthReturnsDayOfMonthSelected (11s)
2019-04-19 08:12:06: 	Pass: adjustDayOfMonthReturnsEndOfMonthWhenAlwaysEndOfMonthIsSet (10s)
2019-04-19 08:12:06: 	Pass: adjustDayOfMonthReturnsSameDateWhenNextDonationNotEndOfMonth (10s)
2019-04-19 08:12:06: 	Pass: adjustDayOfMonthReturnsSameDateWhenNotEndOfMonthDay (11s)
2019-04-19 08:12:06: 	Pass: batchStatusBarTest (20s)
2019-04-19 08:12:06: 	Pass: closeDateIsCalculatedBasedOnDayOfMonth (57s)
2019-04-19 08:12:06: 	Pass: closeDateIsCalculatedBasedOnDayOfMonthStartDateEndOfMonth (18s)
2019-04-19 08:12:06: 	Pass: closeOpenEndedRecurringDonationMarkOppsClosedLost (3003s)
2019-04-19 08:12:06: 	Pass: closeOppForOpenEndedRecurringDonationBadRecurrance (1074s)
2019-04-19 08:12:06: 	Pass: closeOppForOpenEndedRecurringDonationYearly (1006s)
2019-04-19 08:12:06: 	Pass: closeRecurringDonationDeleteOpps (904s)
2019-04-19 08:12:06: 	Pass: errorMessageDisplayedWhenMissingId (54s)
2019-04-19 08:12:06: 	Pass: insertClosedOppForOpenEndedRecurringDonation (878s)
2019-04-19 08:12:06: 	Pass: multipleRDInsert (1204s)
2019-04-19 08:12:06: 	Pass: nextDonationDateIsCalculatedBasedOnDayOfMonthAndCurrentNextDonationDate (13s)
2019-04-19 08:12:06: 	Pass: nextDonationDateIsGreaterOrEqualToDateEstablished (11s)
2019-04-19 08:12:06: 	Pass: shouldUpdateOpenOppCloseDatesWhenRecDonationNextDonationDateIsChanged (1209s)
2019-04-19 08:12:06: 	Pass: testBTN (1296s)
2019-04-19 08:12:06: 	Pass: testBatch (1850s)
2019-04-19 08:12:06: 	Pass: testErrorHandlingAllSysAdmins (1899s)
2019-04-19 08:12:06: 	Pass: testErrorHandlingPublicGroup (1904s)
2019-04-19 08:12:06: 	Pass: testErrorHandlingUser (1858s)
2019-04-19 08:12:06: 	Pass: testInstallmentNumbers (1302s)
2019-04-19 08:12:06: 	Pass: testOpenEndedMonthlyEndDates_28th (1139s)
2019-04-19 08:12:06: 	Pass: testOpenEndedMonthlyEndDates_30th (1219s)
2019-04-19 08:12:06: 	Pass: testOpenEndedMonthlyEndDates_EOM (1062s)
2019-04-19 08:12:06: 	Pass: testOrphanedRd (1242s)
2019-04-19 08:12:06: 	Pass: testRDCustomFieldMappingFixedRD (1124s)
2019-04-19 08:12:06: 	Pass: testRDCustomFieldMappingOpenRD (1203s)
2019-04-19 08:12:06: 	Pass: tooManyInstallments (340s)
2019-04-19 08:12:06: 	Pass: updateMultipleOpenEndedRecurringDonationsPaidAmountWithAClosedWonOpp (1325s)
2019-04-19 08:12:06: 	Pass: updateOpenEndedRecurringDonationsPaidAmountByRemovingAClosedWonOpp (977s)
2019-04-19 08:12:06: 	Pass: updateOpenEndedRecurringDonationsPaidAmountWithAClosedWonOpp (1176s)
2019-04-19 08:12:06: 	Pass: updateOppsFromMultipleRDs (1852s)
2019-04-19 08:12:06: 	Pass: updateRecurringDonationWithClosedOpp (3901s)
2019-04-19 08:12:06: Class: REL_Relationships_TEST
2019-04-19 08:12:06: 	Pass: RelationshipsViewer_TEST (1434s)
2019-04-19 08:12:06: 	Pass: test2Rels1Transaction_v2 (972s)
2019-04-19 08:12:06: 	Pass: testAutoCreateCampaignMemberInsert (1025s)
2019-04-19 08:12:06: 	Pass: testAutoCreateCampaignMemberUpdate (842s)
2019-04-19 08:12:06: 	Pass: testAutoCreateContactInsert (1207s)
2019-04-19 08:12:06: 	Pass: testAutoCreateContactUpdate (1682s)
2019-04-19 08:12:06: 	Pass: testAutoCreateDupePrevention (1605s)
2019-04-19 08:12:06: 	Pass: testContactRel (2069s)
2019-04-19 08:12:06: 	Pass: testDeletingMutuallyReferentialRelationshipsDoesNotPreventDeleteOfReciprocals (1554s)
2019-04-19 08:12:06: 	Pass: testErrorRecordCreation (1105s)
2019-04-19 08:12:06: 	Pass: testExceptionRecordCreation (894s)
2019-04-19 08:12:06: 	Pass: testFemaleGenderFieldReciprocal (960s)
2019-04-19 08:12:06: 	Pass: testFemaleSalutationReciprocal (850s)
2019-04-19 08:12:06: 	Pass: testFieldSyncExclusion (901s)
2019-04-19 08:12:06: 	Pass: testGenderChange (1365s)
2019-04-19 08:12:06: 	Pass: testGenderChangeWithMissingReciprocal (1339s)
2019-04-19 08:12:06: 	Pass: testInversionSettingsHaveType (1123s)
2019-04-19 08:12:06: 	Pass: testInversionSettingsNoType (884s)
2019-04-19 08:12:06: 	Pass: testMaleGenderFieldReciprocal (1054s)
2019-04-19 08:12:06: 	Pass: testMaleSalutationReciprocal (924s)
2019-04-19 08:12:06: 	Pass: testNeutralGenderFieldReciprocal (1062s)
2019-04-19 08:12:06: 	Pass: testNeutralSalutationReciprocal (916s)
2019-04-19 08:12:06: 	Pass: testNoGenderManualRel (1315s)
2019-04-19 08:12:06: 	Pass: testNoGenderManualRelStatusChange (1459s)
2019-04-19 08:12:06: 	Pass: testNoValidSettingsConfig (906s)
2019-04-19 08:12:06: 	Pass: testOrphanedRelDelete (1235s)
2019-04-19 08:12:06: 	Pass: testRelationshipDelete (1045s)
2019-04-19 08:12:06: 	Pass: testRelationshipUTILS (34s)
2019-04-19 08:12:06: 	Pass: testTypeChangeOnly (1001s)
2019-04-19 08:12:06: Class: RLLP_OppPartialSoftCreditRollup_TEST
2019-04-19 08:12:06: 	Pass: testDuplicateOCRSoftCredits (1330s)
2019-04-19 08:12:06: 	Pass: testMulticurrencyPartialSoftCreditRollups (17s)
2019-04-19 08:12:06: 	Pass: testPartialSoftCreditRollups (4888s)
2019-04-19 08:12:06: 	Pass: testPartialSoftCreditRollupsAllStats (1533s)
2019-04-19 08:12:06: 	Pass: test_ContactApplyPartialSoftCredit_AlwaysRollupToPrimaryContactIsFalse (475s)
2019-04-19 08:12:06: 	Pass: test_ContactApplyPartialSoftCredit_AlwaysRollupToPrimaryContactIsTrue (446s)
2019-04-19 08:12:06: 	Pass: test_ContactApplySoftCredit_AlwaysRollupToPrimaryContactIsFalse (384s)
2019-04-19 08:12:06: 	Pass: test_ContactApplySoftCredit_AlwaysRollupToPrimaryContactIsTrue (430s)
2019-04-19 08:12:06: Class: RLLP_OppRollupBATCH_TEST
2019-04-19 08:12:06: 	Pass: testOppAcctRollupBatch (1467s)
2019-04-19 08:12:06: 	Pass: testOppContactRollupBatch (1219s)
2019-04-19 08:12:06: 	Pass: testOppPartialSoftCreditRollupBatch (1415s)
2019-04-19 08:12:06: 	Pass: testOppSoftCreditRollupBatch (1788s)
2019-04-19 08:12:06: Class: RLLP_OppRollup_TEST
2019-04-19 08:12:06: 	Pass: OneContactMultipleOppsHHAccount_1 (1931s)
2019-04-19 08:12:06: 	Pass: OneContactMultipleOppsHHAccount_2 (1550s)
2019-04-19 08:12:06: 	Pass: OneContactMultipleOppsHHAccount_3 (1738s)
2019-04-19 08:12:06: 	Pass: OneContactMultipleOppsHHAccount_4 (1360s)
2019-04-19 08:12:06: 	Pass: OneContactMultipleOppsHHAccount_5 (1243s)
2019-04-19 08:12:06: 	Pass: OneContactMultipleOppsHHAccount_6 (1537s)
2019-04-19 08:12:06: 	Pass: OneContactMultipleOppsOne2One_1 (1380s)
2019-04-19 08:12:06: 	Pass: OneContactMultipleOppsOne2One_2 (1379s)
2019-04-19 08:12:06: 	Pass: OneContactMultipleOppsOne2One_3 (1629s)
2019-04-19 08:12:06: 	Pass: OneContactMultipleOppsOne2One_4 (1313s)
2019-04-19 08:12:06: 	Pass: OneContactMultipleOppsOne2One_5 (1151s)
2019-04-19 08:12:06: 	Pass: OneContactMultipleOppsOne2One_6 (1391s)
2019-04-19 08:12:06: 	Pass: OneContactOneInkindHHAccount (744s)
2019-04-19 08:12:06: 	Pass: OneContactOneInkindOne2One (664s)
2019-04-19 08:12:06: 	Pass: shouldCallCustomizableRollupsWhenEnabledAndAsync (230s)
2019-04-19 08:12:06: 	Pass: shouldEnqueMultipleCustomizableRollupsForMultipleSObjects (300s)
2019-04-19 08:12:06: 	Pass: shouldNotCallCustomizableRollupsWhenDisabledAndAsync (48s)
2019-04-19 08:12:06: 	Pass: testGivingRollupAcctHHAccount (416s)
2019-04-19 08:12:06: 	Pass: testGivingRollupAcctMembershipHHAccount (541s)
2019-04-19 08:12:06: 	Pass: testGivingRollupAcctMembershipOne2One (520s)
2019-04-19 08:12:06: 	Pass: testGivingRollupAcctOne2One (396s)
2019-04-19 08:12:06: 	Pass: testGivingRollupAlwaysPrimaryHHAccount (968s)
2019-04-19 08:12:06: 	Pass: testGivingRollupAlwaysPrimaryOne2One (839s)
2019-04-19 08:12:06: 	Pass: testGivingRollupBatchHHAccount (5035s)
2019-04-19 08:12:06: 	Pass: testGivingRollupBatchOne2One (4915s)
2019-04-19 08:12:06: 	Pass: testGivingRollupBulkHHAccount (6862s)
2019-04-19 08:12:06: 	Pass: testGivingRollupBulkOne2One (6610s)
2019-04-19 08:12:06: 	Pass: testGivingRollupExcludedRTHHAccount (884s)
2019-04-19 08:12:06: 	Pass: testGivingRollupExcludedRTOne2One (767s)
2019-04-19 08:12:06: 	Pass: testGivingRollupHHAccount (964s)
2019-04-19 08:12:06: 	Pass: testGivingRollupIndividualBucket (991s)
2019-04-19 08:12:06: 	Pass: testGivingRollupIndividualHHAccount (1012s)
2019-04-19 08:12:06: 	Pass: testGivingRollupOne2One (940s)
2019-04-19 08:12:06: 	Pass: testMemberRollupHHAccount (1000s)
2019-04-19 08:12:06: 	Pass: testMemberRollupOne2One (961s)
2019-04-19 08:12:06: Class: RLLP_OppRollup_TEST2
2019-04-19 08:12:06: 	Pass: testFYUtility (42s)
2019-04-19 08:12:06: 	Pass: testFiscalYearandCustomNDayHHAccount (1202s)
2019-04-19 08:12:06: 	Pass: testFiscalYearandCustomNDayOne2One (923s)
2019-04-19 08:12:06: 	Pass: testFutureMethodsHHAccount (2315s)
2019-04-19 08:12:06: 	Pass: testFutureMethodsOne2One (2091s)
2019-04-19 08:12:06: 	Pass: testGetFiscalYearForDate (16s)
2019-04-19 08:12:06: 	Pass: testGivingRollupTooManyOppsHHAccount (8739s)
2019-04-19 08:12:06: 	Pass: testGivingRollupTooManyOppsOne2One (7630s)
2019-04-19 08:12:06: 	Pass: testHouseholdStatsHHAccount (1281s)
2019-04-19 08:12:06: 	Pass: testHouseholdStatsOne2One (1196s)
2019-04-19 08:12:06: 	Pass: testMultiCurrencyMethodsHHAccount (591s)
2019-04-19 08:12:06: 	Pass: testMultiCurrencyMethodsOne2One (421s)
2019-04-19 08:12:06: 	Pass: testOpportunityUtilityErrorHandlingHHAccount (1128s)
2019-04-19 08:12:06: 	Pass: testOpportunityUtilityErrorHandlingOne2One (1195s)
2019-04-19 08:12:06: 	Pass: testOrgSoftCreditsHHAccount (1908s)
2019-04-19 08:12:06: 	Pass: testOrgSoftCreditsOne2One (1532s)
2019-04-19 08:12:06: 	Pass: testRollupAllsHHAccount (116s)
2019-04-19 08:12:06: 	Pass: testRollupAllsOne2One (111s)
2019-04-19 08:12:06: 	Pass: testSoftCreditsHHAccount (2747s)
2019-04-19 08:12:06: 	Pass: testSoftCreditsOne2One (2160s)
2019-04-19 08:12:06: 	Pass: testUDRChangeBehaviorHHAccount (1290s)
2019-04-19 08:12:06: 	Pass: testUDRChangeBehaviorOne2One (1071s)
2019-04-19 08:12:06: 	Pass: testUserDefinedRollupHHAccount (1204s)
2019-04-19 08:12:06: 	Pass: testUserDefinedRollupOne2One (979s)
2019-04-19 08:12:06: Class: RP_GettingStartedTest
2019-04-19 08:12:06: 	Pass: testGettingStartedLinks (15s)
2019-04-19 08:12:06: Class: RP_GitHubTest
2019-04-19 08:12:06: 	Pass: testFailedRequest (59s)
2019-04-19 08:12:06: 	Pass: testFormatDate (375s)
2019-04-19 08:12:06: 	Pass: testLoadReleaseNotesFromSFORG (17s)
2019-04-19 08:12:06: Class: RP_GitHubTestMock
2019-04-19 08:12:06: Class: RP_YoutubeTest
2019-04-19 08:12:06: 	Pass: testFailedRequest (102s)
2019-04-19 08:12:06: 	Pass: testYoutubeListOfVideos (12s)
2019-04-19 08:12:06: Class: RP_YoutubeTestMock
2019-04-19 08:12:06: Class: STG_InstallScript_TEST
2019-04-19 08:12:06: 	Pass: defaultSettingsCreated (324s)
2019-04-19 08:12:06: 	Pass: deletedHandlers (424s)
2019-04-19 08:12:06: 	Pass: mappingsTest_runScriptCustomConfigOnInstallAllFlags (302s)
2019-04-19 08:12:06: 	Pass: mappingsTest_runScriptCustomConfigOnInstallSomeFlags (241s)
2019-04-19 08:12:06: 	Pass: mappingsTest_runScriptNoCustomConfigOnInstall (223s)
2019-04-19 08:12:06: 	Pass: mappingsTest_runScriptNoCustomSettings (213s)
2019-04-19 08:12:06: 	Pass: missingSettingsCreated (261s)
2019-04-19 08:12:06: 	Pass: push (202s)
2019-04-19 08:12:06: 	Pass: testErrorLoggerCorrectlyBuildsEmailBody (17s)
2019-04-19 08:12:06: 	Pass: testErrorLoggerHasErrorsReturnsFalse (10s)
2019-04-19 08:12:06: 	Pass: testErrorLoggerHasErrorsReturnsTrue (10s)
2019-04-19 08:12:06: 	Pass: testExceptionsAreEmailedAndLogged (353s)
2019-04-19 08:12:06: 	Pass: testInstallActionsAreIndependent (248s)
2019-04-19 08:12:06: 	Pass: testNewInstallSetsRecurringDonationInstallmentNumber (2023s)
2019-04-19 08:12:06: 	Pass: testNoEmailIsSentOrErrorLoggedOnSuccessfulInstall (129s)
2019-04-19 08:12:06: 	Pass: upgrade (224s)
2019-04-19 08:12:06: Class: STG_InstallScript_TEST2
2019-04-19 08:12:06: 	Pass: handlersChanged (97s)
2019-04-19 08:12:06: 	Pass: handlersChanged_UserManaged (50s)
2019-04-19 08:12:06: Class: STG_PanelHealthCheck_TEST
2019-04-19 08:12:06: 	Pass: shouldCreateDefectResultForEachInvalidRecordType (149s)
2019-04-19 08:12:06: 	Pass: shouldCreateErrorDefectResultWhenOppDisableContactRoleAutomationIsChecked (976s)
2019-04-19 08:12:06: 	Pass: test_VerifyAccountModelRecordType_DefaultRT_In_SettingsHHRT (39s)
2019-04-19 08:12:06: 	Pass: test_VerifyAccountModelRecordType_DefaultRT_In_SettingsOneToOneRT (33s)
2019-04-19 08:12:06: 	Pass: test_VerifyAccountModelRecordType_InvalidIDRT_In_SettingsHHRT (60s)
2019-04-19 08:12:06: 	Pass: test_VerifyAccountModelRecordType_InvalidIDRT_In_SettingsOneToOneRT (20s)
2019-04-19 08:12:06: 	Pass: test_VerifyAccountModelRecordType_InvalidRT_In_SettingsHHRT (35s)
2019-04-19 08:12:06: 	Pass: test_VerifyAccountModelRecordType_InvalidRT_In_SettingsOneToOneRT (32s)
2019-04-19 08:12:06: 	Pass: test_VerifyAccountModelRecordType_NonDefaultRT_In_SettingsHHRT (33s)
2019-04-19 08:12:06: 	Pass: test_VerifyAccountModelRecordType_NonDefaultRT_In_SettingsOneToOneRT (34s)
2019-04-19 08:12:06: 	Pass: verifyLevelFieldsExist (400s)
2019-04-19 08:12:06: 	Pass: verifyLevelSourceFieldNumeric (132s)
2019-04-19 08:12:06: 	Pass: verifyNoMissingOppPaymentsFail (788s)
2019-04-19 08:12:06: 	Pass: verifyNoMissingOppPaymentsSuccess (470s)
2019-04-19 08:12:06: 	Pass: verifyOCRSettingsCheck (50s)
2019-04-19 08:12:06: 	Pass: verifyTriggerHandlers_fail (232s)
2019-04-19 08:12:06: 	Pass: verifyTriggerHandlers_succeed (133s)
2019-04-19 08:12:06: Class: STG_PanelHouseholds_TEST
2019-04-19 08:12:06: 	Pass: testExampleNameIsAnErrorWhenImplementingClassIsInvalid (52s)
2019-04-19 08:12:06: 	Pass: testExampleNameIsExpectedWhenHHNameFormatFieldIsValid (16s)
2019-04-19 08:12:06: 	Pass: testExampleNameThrowsExceptionWhenHHNameFormatFieldIsInvalid (13s)
2019-04-19 08:12:06: 	Pass: testPanelHasPanelId (10s)
2019-04-19 08:12:06: 	Pass: testPanelPageHasErrorWhenAccountModelIsNotAsExpected (28s)
2019-04-19 08:12:06: 	Pass: testPanelPageHasErrorWhenHHNamingSettingsFieldIsInvalid (93s)
2019-04-19 08:12:06: 	Pass: testPanelValidatesHHNamingSettingsWhetherAutomaticHHNamingIsOn (83s)
2019-04-19 08:12:06: 	Pass: testPanelValidatesUserChangesOfHHNamingSettings (47s)
2019-04-19 08:12:06: 	Pass: testSaveSettingsSavesAutomaticHHNaming (36s)
2019-04-19 08:12:06: Class: STG_PanelOpps_TEST
2019-04-19 08:12:06: 	Pass: testGetOpportunityStageSelectOptionsContainsAtLeastEmptySelection (24s)
2019-04-19 08:12:06: Class: STG_SettingsManager_TEST
2019-04-19 08:12:06: 	Pass: TEST_userRollupSettings (272s)
2019-04-19 08:12:06: 	Pass: testDataBoundMultiSelect (24s)
2019-04-19 08:12:06: 	Pass: testPanel (54s)
2019-04-19 08:12:06: 	Pass: testPanelAffl (19s)
2019-04-19 08:12:06: 	Pass: testPanelAllo (68s)
2019-04-19 08:12:06: 	Pass: testPanelBDE (23s)
2019-04-19 08:12:06: 	Pass: testPanelCRLP (1356s)
2019-04-19 08:12:06: 	Pass: testPanelContactRoles (81s)
2019-04-19 08:12:06: 	Pass: testPanelContacts (31s)
2019-04-19 08:12:06: 	Pass: testPanelErrorLog (52s)
2019-04-19 08:12:06: 	Pass: testPanelHealthCheck (944s)
2019-04-19 08:12:06: 	Pass: testPanelLeads (23s)
2019-04-19 08:12:06: 	Pass: testPanelLvlAssignBatch (20s)
2019-04-19 08:12:06: 	Pass: testPanelMembership (18s)
2019-04-19 08:12:06: 	Pass: testPanelOppBatch (233s)
2019-04-19 08:12:06: 	Pass: testPanelOppNaming (88s)
2019-04-19 08:12:06: 	Pass: testPanelOppRollups (14s)
2019-04-19 08:12:06: 	Pass: testPanelOpps (13s)
2019-04-19 08:12:06: 	Pass: testPanelPanelPrimaryContactRoleMergeBatch (86s)
2019-04-19 08:12:06: 	Pass: testPanelPaymentMapping (213s)
2019-04-19 08:12:06: 	Pass: testPanelRD (170s)
2019-04-19 08:12:06: 	Pass: testPanelRDBatch (77s)
2019-04-19 08:12:06: 	Pass: testPanelRDCustomFieldMapping (261s)
2019-04-19 08:12:06: 	Pass: testPanelRDCustomInstallment (260s)
2019-04-19 08:12:06: 	Pass: testPanelRel (211s)
2019-04-19 08:12:06: 	Pass: testPanelRelAuto (196s)
2019-04-19 08:12:06: 	Pass: testPanelRelReciprocal (234s)
2019-04-19 08:12:06: 	Pass: testPanelRenameHHDoesNotRunBatchWhenHHNamingSettingsIsInvalid (74s)
2019-04-19 08:12:06: 	Pass: testPanelRenameHHRunsBatchWhenAutomaticHHNamingIsOff (102s)
2019-04-19 08:12:06: 	Pass: testPanelRenameHHRunsBatchWhenAutomaticHHNamingIsOn (55s)
2019-04-19 08:12:06: 	Pass: testPanelSchedule (24s)
2019-04-19 08:12:06: 	Pass: testPanelTDTM (212s)
2019-04-19 08:12:06: 	Pass: testPanelUserRollup (235s)
2019-04-19 08:12:06: 	Pass: testRecordTypeSettingsUpdateExceptionIsDisplayed (1000s)
2019-04-19 08:12:06: 	Pass: testRequiredJobsAreScheduledWhenNpspSettingsPageLoads (903s)
2019-04-19 08:12:06: 	Pass: testSettingsManager (13s)
2019-04-19 08:12:06: 	Pass: testSettingsService (20s)
2019-04-19 08:12:06: Class: STG_UninstallScript_TEST
2019-04-19 08:12:06: 	Pass: rununinstall (833s)
2019-04-19 08:12:06: Class: TDTM_Config_API_Test
2019-04-19 08:12:06: 	Pass: test_disable_for_specific_user (323s)
2019-04-19 08:12:06: 	Pass: test_disable_trigger_in_context (681s)
2019-04-19 08:12:06: 	Pass: triggersAreDisabledForCurrentContext (63s)
2019-04-19 08:12:06: Class: TDTM_DMLgt200_TEST
2019-04-19 08:12:06: 	Pass: testAllocationsCreatedForManyOpenEndedRecurringDonations (12105s)
2019-04-19 08:12:06: 	Pass: testBulkOpportunitiesWithCampaignAlloc (8617s)
2019-04-19 08:12:06: 	Pass: test_address_validation (21334s)
2019-04-19 08:12:06: 	Pass: test_addresses (14709s)
2019-04-19 08:12:06: 	Pass: test_contacts_with_affiliations (13151s)
2019-04-19 08:12:06: 	Pass: test_contacts_with_primary_affiliations (10625s)
2019-04-19 08:12:06: 	Pass: test_contacts_with_relationships (12501s)
2019-04-19 08:12:06: 	Pass: test_household_account_naming (15112s)
2019-04-19 08:12:06: 	Pass: test_recurring_donations (7572s)
2019-04-19 08:12:06: Class: TDTM_Runnable_TEST
2019-04-19 08:12:06: 	Pass: groupByTypeShouldGroupSObjectsByType (743s)
2019-04-19 08:12:06: 	Pass: groupByTypeShouldRemoveDuplicateSObjects (622s)
2019-04-19 08:12:06: 	Pass: testAsync (801s)
2019-04-19 08:12:06: Class: TDTM_TriggerScaffolds_TEST
2019-04-19 08:12:06: 	Pass: tdtmCampaign (186s)
2019-04-19 08:12:06: 	Pass: tdtmLead (186s)
2019-04-19 08:12:06: Class: USER_InActiveUser_TDTM_TEST
2019-04-19 08:12:06: 	Pass: testHandlingDeactivatedSysAdmin (779s)
2019-04-19 08:12:06: Class: USER_MixedDML_TEST
2019-04-19 08:12:06: 	Pass: testInsertingUserWithTriggerHandlerMixedDML (786s)
2019-04-19 08:12:06: Class: USER_UserService_TEST
2019-04-19 08:12:06: 	Pass: isCustomizeApplicationUserReturnsFalseWhenReadOnlyUserDoesNotHaveCustomizeAppPermissionSet (445s)
2019-04-19 08:12:06: 	Pass: isCustomizeApplicationUserReturnsTrueForSystemAdmin (194s)
2019-04-19 08:12:06: 	Pass: isCustomizeApplicationUserReturnsTrueWhenReadOnlyUserHasCustomizeAppPermissionSet (619s)
2019-04-19 08:12:06: 	Pass: testDeactivatedSysAdminHandling (467s)
2019-04-19 08:12:06: 	Pass: testHandleScheduledJobsSubmittedByInActiveSysAdmin (1511s)
2019-04-19 08:12:06: 	Pass: testIsActiveUser (378s)
2019-04-19 08:12:06: 	Pass: testIsSysAdmin (450s)
2019-04-19 08:12:06: 	Pass: testLEX (15s)
2019-04-19 08:12:06: 	Pass: testLoggingInActiveSysAdminError (39s)
2019-04-19 08:12:06: 	Pass: testNotifyingSysAdminsAboutInActiveSysAdminUser (142s)
2019-04-19 08:12:06: 	Pass: testSendingInActiveSysAdminEmail (105s)
2019-04-19 08:12:06: 	Pass: testSetErrorNotificationToAllSysAdmins (530s)
2019-04-19 08:12:06: Class: UTIL_CurrencyCache_TEST
2019-04-19 08:12:06: 	Pass: test_AdvancedCurrencyConversion (36s)
2019-04-19 08:12:06: 	Pass: test_CurrencyCache_StaticCacheVar (21s)
2019-04-19 08:12:06: Class: UTIL_CurrencyConversion_TEST
2019-04-19 08:12:06: 	Pass: test_CurrencyConversionWithDatedRates (32s)
2019-04-19 08:12:06: Class: UTIL_Currency_TEST
2019-04-19 08:12:06: 	Pass: testGetCurrencySymbolQueriesForCodeIfMultiCurrency (12s)
2019-04-19 08:12:06: 	Pass: testGetCurrencySymbolReturnsDefaultCurrencySymbolIfSingleCurrency (5s)
2019-04-19 08:12:06: 	Pass: testGetDefaultCurrencySymbolReturnsIsoCodeIfUnknownSymbol (5s)
2019-04-19 08:12:06: 	Pass: testGetDefaultCurrencySymbolReturnsKnownSymbol (6s)
2019-04-19 08:12:06: 	Pass: testGetDefaultCurrencyWrapsUserInfoMethod (5s)
2019-04-19 08:12:06: 	Pass: testGetDefaultOrgCurrencyMethod (17s)
2019-04-19 08:12:06: 	Pass: testIsMultiCurrencyOrganizationWrapsUserInfoMethod (5s)
2019-04-19 08:12:06: 	Pass: testSingletonReturnsExistingInstance (5s)
2019-04-19 08:12:06: 	Pass: testSingletonReturnsNewInstanceIfNoExisting (5s)
2019-04-19 08:12:06: Class: UTIL_DMLService_TEST
2019-04-19 08:12:06: 	Pass: testRecordInsertDMLOptions (524s)
2019-04-19 08:12:06: 	Pass: testRecordInsertWithAllOrNone (284s)
2019-04-19 08:12:06: 	Pass: testRecordInsertWithDefaults (277s)
2019-04-19 08:12:06: 	Pass: testRecordUpdateWithAllOrNone (357s)
2019-04-19 08:12:06: 	Pass: testRecordUpdateWithDMLOptions (377s)
2019-04-19 08:12:06: 	Pass: testRecordUpdateWithDefaults (412s)
2019-04-19 08:12:06: 	Pass: testRecordUpsertWithAllOrNone (386s)
2019-04-19 08:12:06: 	Pass: testRecordUpsertWithDefaults (194s)
2019-04-19 08:12:06: 	Pass: testRecordsInsertWithAllOrNoneFalse (430s)
2019-04-19 08:12:06: 	Pass: testRecordsInsertWithAllOrNoneTrue (290s)
2019-04-19 08:12:06: 	Pass: testRecordsInsertWithDMLOptions (279s)
2019-04-19 08:12:06: 	Pass: testRecordsInsertWithDefaults (296s)
2019-04-19 08:12:06: 	Pass: testRecordsUpdateWithAllOrNone (374s)
2019-04-19 08:12:06: 	Pass: testRecordsUpdateWithDMLOptions (361s)
2019-04-19 08:12:06: 	Pass: testRecordsUpdateWithDefaults (369s)
2019-04-19 08:12:06: 	Pass: testRecordsUpsertWithAllOrNone (422s)
2019-04-19 08:12:06: 	Pass: testRecordsUpsertWithDefaults (476s)
2019-04-19 08:12:06: 	Pass: testRespectDuplicateRuleSettingsForAccounts (413s)
2019-04-19 08:12:06: 	Pass: testRespectDuplicateRuleSettingsForContacts (714s)
2019-04-19 08:12:06: Class: UTIL_Describe_TEST
2019-04-19 08:12:06: 	Pass: testDescribe (437s)
2019-04-19 08:12:06: Class: UTIL_FeatureManagement_TEST
2019-04-19 08:12:06: 	Pass: callsSetPackageBooleanValue (50s)
2019-04-19 08:12:06: 	Pass: callsSetPackageIntegerValue (38s)
2019-04-19 08:12:06: Class: UTIL_Finder_TEST
2019-04-19 08:12:06: 	Pass: executeSearchAppliesPostSortingWhenOrderByFieldIsNotSortable (28s)
2019-04-19 08:12:06: 	Pass: executeSearchDoesNotApplyPostSortingsWhenOrderByFieldIsSortable (14s)
2019-04-19 08:12:06: 	Pass: executeSearchReturnsLimitNumberOfRecords (12s)
2019-04-19 08:12:06: 	Pass: executeSearchWhenSearchQueryContainsSpecialCharacters (723s)
2019-04-19 08:12:06: 	Pass: findQueryIntegrationTest (670s)
2019-04-19 08:12:06: 	Pass: findQueryIntegrationTestWithPostSorting (654s)
2019-04-19 08:12:06: 	Pass: findReturnsMinLimitAndRecordSizeRecords (13s)
2019-04-19 08:12:06: 	Pass: findReturnsUniqueFieldsInSoql (19s)
2019-04-19 08:12:06: 	Pass: findReturnsUniqueFieldsInSosl (32s)
2019-04-19 08:12:06: 	Pass: findSucceedsWhenCompleteQueryReturnsEmptyList (14s)
2019-04-19 08:12:06: 	Pass: findSucceedsWhenCriteriaAndOrderByClausesAreEmpty (14s)
2019-04-19 08:12:06: 	Pass: findSucceedsWhenPostFilteringIsAppliedOnOnTheInSetSearch (760s)
2019-04-19 08:12:06: 	Pass: findSucceedsWhenQueryReturnsEmptyList (16s)
2019-04-19 08:12:06: 	Pass: findSucceedsWhenQueryReturnsEmptyListForPostSorting (13s)
2019-04-19 08:12:06: 	Pass: findSucceedsWhenSearchQueryContainsSpecialCharacters (741s)
2019-04-19 08:12:06: 	Pass: findSucceedsWhenSearchReturnsEmptyList (12s)
2019-04-19 08:12:06: 	Pass: findSucceedsWhenSearchReturnsLimitNumberOfRecords (15s)
2019-04-19 08:12:06: 	Pass: findSucceedsWhenSearchReturnsRecordsForPostFiltering (14s)
2019-04-19 08:12:06: 	Pass: findSucceedsWhenSearchReturnsRecordsForPostFilteringAndSorting (14s)
2019-04-19 08:12:06: 	Pass: findSucceedsWhenSearchingForValuesInTheSet (650s)
2019-04-19 08:12:06: 	Pass: searchBuildReturnsSoslWhenOrderByIsNotProvided (27s)
2019-04-19 08:12:06: 	Pass: searchBuildReturnsSoslWithAllElements (25s)
2019-04-19 08:12:06: 	Pass: searchBuildReturnsSoslWithLogicOperatorsInTheFind (21s)
2019-04-19 08:12:06: 	Pass: searchBuildThrowsAnExceptionWhenFieldsAreNotProvided (10s)
2019-04-19 08:12:06: 	Pass: searchBuildThrowsAnExceptionWhenSObjectTypeIsNotProvided (10s)
2019-04-19 08:12:06: 	Pass: searchBuildThrowsAnExceptionWhenSearchCriteriaIsNotProvided (9s)
2019-04-19 08:12:06: Class: UTIL_HtmlOutput_TEST
2019-04-19 08:12:06: 	Pass: shouldReturnEscapedTag (29s)
2019-04-19 08:12:06: 	Pass: shouldReturnEscapedUrl (9s)
2019-04-19 08:12:06: 	Pass: shouldReturnOriginalTag (11s)
2019-04-19 08:12:06: 	Pass: shouldReturnOriginalTagWithSpace (10s)
2019-04-19 08:12:06: 	Pass: shouldReturnOriginalUrl (14s)
2019-04-19 08:12:06: 	Pass: shouldReturnOriginalUrlWithSpace (13s)
2019-04-19 08:12:06: Class: UTIL_JobProgress_CTRL_TEST
2019-04-19 08:12:06: 	Pass: checkNullBatchJobProgressBehavior (94s)
2019-04-19 08:12:06: 	Pass: jobProgressController (330s)
2019-04-19 08:12:06: Class: UTIL_Namespace_TEST
2019-04-19 08:12:06: 	Pass: TestNamespacePrefixFixups (7s)
2019-04-19 08:12:06: 	Pass: keepUnusedPackagedLabelsInPackage (7s)
2019-04-19 08:12:06: 	Pass: shouldRemoveClassNamespace (5s)
2019-04-19 08:12:06: 	Pass: shouldReturnClassNameWhenNoNamespacePresent (5s)
2019-04-19 08:12:06: 	Pass: testSandboxEmailToRealEmail (6s)
2019-04-19 08:12:06: Class: UTIL_OrderBy_TEST
2019-04-19 08:12:06: 	Pass: buildCreatesEmptyOrderByClauseWhenFieldsAreNotProvided (13s)
2019-04-19 08:12:06: 	Pass: buildReturnsEmptyOrderByClauseWhenAFieldIsNotSortable (7s)
2019-04-19 08:12:06: 	Pass: buildReturnsOrderByClauseWhenAllFieldsAreSortable (10s)
2019-04-19 08:12:06: 	Pass: compareToIsCaseInsensitive (12s)
2019-04-19 08:12:06: 	Pass: compareToReturnsNegativeNumberForDescOrder (10s)
2019-04-19 08:12:06: 	Pass: compareToReturnsNegativeNumberWhenOtherIsNullAscOrderNullsLast (10s)
2019-04-19 08:12:06: 	Pass: compareToReturnsNegativeNumberWhenOtherIsNullDescOrderNullsLast (10s)
2019-04-19 08:12:06: 	Pass: compareToReturnsNegativeNumberWhenValueIsNullAscOrderNullsFirst (10s)
2019-04-19 08:12:06: 	Pass: compareToReturnsNegativeNumberWhenValuePreceedsOther (10s)
2019-04-19 08:12:06: 	Pass: compareToReturnsPositiveNumberForDescOrder (9s)
2019-04-19 08:12:06: 	Pass: compareToReturnsPositiveNumberWhenOtherIsNullDescOrderNullsFirst (10s)
2019-04-19 08:12:06: 	Pass: compareToReturnsPositiveNumberWhenValueFollowsOther (10s)
2019-04-19 08:12:06: 	Pass: compareToReturnsPositiveNumberWhenValueIsNullAscOrderNullsLast (9s)
2019-04-19 08:12:06: 	Pass: compareToReturnsPostiveNumberWhenOtherIsNullAscOrderNullsFirst (9s)
2019-04-19 08:12:06: 	Pass: compareToReturnsZeroWhenValuesAreTheSame (9s)
2019-04-19 08:12:06: 	Pass: getFieldNameReturnsName (9s)
2019-04-19 08:12:06: 	Pass: getFieldNameReturnsNameForTheRelationshipField (10s)
2019-04-19 08:12:06: 	Pass: getValueReturnsSObjectFieldValue (14s)
2019-04-19 08:12:06: 	Pass: isSortDescReturnsFalseForAscSortOrder (11s)
2019-04-19 08:12:06: 	Pass: isSortDescReturnsTrueForDescSortOrder (9s)
2019-04-19 08:12:06: 	Pass: sortOrdersRecordsManuallyWhenFieldsAreNotSortable (11s)
2019-04-19 08:12:06: 	Pass: sortOrdersRecordsManuallyWhenTheFieldIsNotSortable (11s)
2019-04-19 08:12:06: 	Pass: sortOrdersRecordsManuallyWhenTheValueIsNullForNullsFirst (11s)
2019-04-19 08:12:06: 	Pass: sortOrdersRecordsManuallyWhenTheValueIsNullForNullsLast (10s)
2019-04-19 08:12:06: 	Pass: sortOrdersRecordsOrderAscByDefault (406s)
2019-04-19 08:12:06: 	Pass: sortOrdersRecordsOrderDesc (202s)
2019-04-19 08:12:06: 	Pass: sortOrdersRecordsTheSameAsSoqlWithMultipleFields (66722s)
2019-04-19 08:12:06: 	Pass: sortOrdersRecordsTheSameAsSoqlWithRelationshipFields (408s)
2019-04-19 08:12:06: 	Pass: toStringReturnsOrderByForAField (9s)
2019-04-19 08:12:06: 	Pass: toStringReturnsOrderByForFieldAndAscSortOrder (9s)
2019-04-19 08:12:06: 	Pass: toStringReturnsOrderByForFieldAndDescSortOrder (9s)
2019-04-19 08:12:06: 	Pass: toStringReturnsOrderByForFieldAndSortOrderAndNullOrderFirst (8s)
2019-04-19 08:12:06: 	Pass: toStringReturnsOrderByForFieldAndSortOrderAndNullOrderLast (9s)
2019-04-19 08:12:06: 	Pass: toStringReturnsOrderByForRelationshipField (9s)
2019-04-19 08:12:06: Class: UTIL_OrgTelemetry_Batch_TEST
2019-04-19 08:12:06: 	Pass: validateTelemetryBatchJob (254s)
2019-04-19 08:12:06: Class: UTIL_OrgTelemetry_SObject_BATCH_TEST
2019-04-19 08:12:06: 	Pass: opportunitiesJobModeShouldReturnCorrectQueryWhenThereIsALastProcessedId (232s)
2019-04-19 08:12:06: 	Pass: opportunitiesJobModeShouldReturnCorrectQueryWhenThereIsNoLastProcessedId (66s)
2019-04-19 08:12:06: 	Pass: recurringDonationsJobModeShouldReturnCorrectQueryWhenThereIsALastProcessedId (67s)
2019-04-19 08:12:06: 	Pass: recurringDonationsJobModeShouldReturnCorrectQueryWhenThereIsNoLastProcessedId (62s)
2019-04-19 08:12:06: 	Pass: shouldCalculateCorrectRecurringDonationMetrics (62s)
2019-04-19 08:12:06: 	Pass: shouldCalculateCorrectRecurringDonationOppMetrics (65s)
2019-04-19 08:12:06: 	Pass: shouldCaptureRecurringDonationMetricsInFeatureManagement (63s)
2019-04-19 08:12:06: 	Pass: shouldCaptureRecurringDonationOppMetricsInFeatureManagement (9s)
2019-04-19 08:12:06: 	Pass: shouldChainNextBatchOffsetByLastRecordProcessed (236s)
2019-04-19 08:12:06: 	Pass: shouldNotChainNextBatchIfLastProcessedIdIsNull (14s)
2019-04-19 08:12:06: 	Pass: shouldNotChainNextBatchIfThereAreNoMoreRecordsToProcess (32s)
2019-04-19 08:12:06: 	Pass: testSObjectBatchJob (256s)
2019-04-19 08:12:06: Class: UTIL_OrgTelemetry_TEST
2019-04-19 08:12:06: 	Pass: shouldCalculateMinutesBetweenTwoDateTimes (9s)
2019-04-19 08:12:06: 	Pass: validateCountOfErrorLogTelemetry (75s)
2019-04-19 08:12:07: 	Pass: validateCountOfRDOppsTelemetry (20s)
2019-04-19 08:12:07: 	Pass: validateCountOfRecurringDonationsTelemetry (18s)
2019-04-19 08:12:07: 	Pass: validateMaxNumRelatedOppsTelemetry (139s)
2019-04-19 08:12:07: 	Pass: validateNPSPSettingsTelemetry (42s)
2019-04-19 08:12:07: 	Pass: validateOrgEnvironmentTelemetry (42s)
2019-04-19 08:12:07: Class: UTIL_PerfLogger_TEST
2019-04-19 08:12:07: 	Pass: testPerfLoggerMultipleCallsSameLabel (2094s)
2019-04-19 08:12:07: 	Pass: testPerfLoggerSaving (2030s)
2019-04-19 08:12:07: 	Pass: testPerfLoggerTiming (2035s)
2019-04-19 08:12:07: Class: UTIL_Permissions_TEST
2019-04-19 08:12:07: 	Pass: readOnlyUserCannotReadCustomFieldException (355s)
2019-04-19 08:12:07: 	Pass: readOnlyUserCannotReadCustomObjectException (225s)
2019-04-19 08:12:07: 	Pass: readOnlyUserCannotUpdateStandardFieldException (209s)
2019-04-19 08:12:07: 	Pass: readOnlyUserCannotUpdateStandardObjectException (213s)
2019-04-19 08:12:07: 	Pass: readOnlyUserFieldCheckNoException (224s)
2019-04-19 08:12:07: 	Pass: readOnlyUserObjectCheckNoException (258s)
2019-04-19 08:12:07: 	Pass: shouldReturnFalseForReadOnlyUserOnCustomObjectAndFields (223s)
2019-04-19 08:12:07: 	Pass: shouldReturnTrueForAdminUserOnCustomObjectAndFields (207s)
2019-04-19 08:12:07: 	Pass: sysAdminCanDeleteCustomObjectException (216s)
2019-04-19 08:12:07: 	Pass: sysAdminCanUpdateCustomFieldException (217s)
2019-04-19 08:12:07: 	Pass: sysAdminFieldCheckNoException (221s)
2019-04-19 08:12:07: 	Pass: sysAdminObjectCheckNoException (249s)
2019-04-19 08:12:07: Class: UTIL_Profile_TEST
2019-04-19 08:12:07: 	Pass: testGetInstanceQueriesOnceOnMultipleCalls (17s)
2019-04-19 08:12:07: 	Pass: testGetProfileIdsWithInvalidProfileName (13s)
2019-04-19 08:12:07: 	Pass: testGetProfileIdsWithValidProfileName (26s)
2019-04-19 08:12:07: Class: UTIL_Query_TEST
2019-04-19 08:12:07: 	Pass: testSoqlBuildFailsWhenFromValueIsNotProvided (37s)
2019-04-19 08:12:07: 	Pass: testSoqlBuildFailsWhenNoSelectFieldIsProvided (7s)
2019-04-19 08:12:07: 	Pass: testSoqlBuildFailsWhenSelectFieldIsEmpty (8s)
2019-04-19 08:12:07: 	Pass: testSoqlBuildSucceedsWhenWhereClauseIsEmpty (9s)
2019-04-19 08:12:07: 	Pass: testSoqlDoesNotContainDuplicateSelectFields (8s)
2019-04-19 08:12:07: 	Pass: testSoqlExcludesToLabelSalutationWhenSettingsIsOff (8s)
2019-04-19 08:12:07: 	Pass: testSoqlIncludesToLabelSalutationWhenSettingsIsOn (10s)
2019-04-19 08:12:07: 	Pass: testSoqlIsCorrectWhenFromSObjectTypeIsProvided (7s)
2019-04-19 08:12:07: 	Pass: testSoqlIsCorrectWhenLimitClauseIsProvided (1611s)
2019-04-19 08:12:07: 	Pass: testSoqlIsCorrectWhenMultipleWhereClausesAreProvided (208s)
2019-04-19 08:12:07: 	Pass: testSoqlIsCorrectWhenOptionalClausesAreNotProvided (6s)
2019-04-19 08:12:07: 	Pass: testSoqlIsCorrectWhenOrderByClauseIsProvided (184s)
2019-04-19 08:12:07: 	Pass: testSoqlIsCorrectWhenWhereClauseIsProvided (196s)
2019-04-19 08:12:07: Class: UTIL_RecordTypeSettingsUpdate_TEST
2019-04-19 08:12:07: 	Pass: testBlankSettingsRemainBlank (15s)
2019-04-19 08:12:07: 	Pass: testEmptyValuesAreDiscarded (8s)
2019-04-19 08:12:07: 	Pass: testIdsRemainIds (7s)
2019-04-19 08:12:07: 	Pass: testKitchenSink (7s)
2019-04-19 08:12:07: 	Pass: testKnownRecordTypeNamesAreConverted (7s)
2019-04-19 08:12:07: 	Pass: testNullSettingsRemainNull (8s)
2019-04-19 08:12:07: 	Pass: testRecordTypeNameIsCaseInsensitive (5s)
2019-04-19 08:12:07: 	Pass: testRecordTypeNamesAreCaseInsensitive (5s)
2019-04-19 08:12:07: 	Pass: testUnknownRecordTypeNamesAreDiscarded (7s)
2019-04-19 08:12:07: 	Pass: testUpdateDoesNotRunOnUpgradeFrom379 (129s)
2019-04-19 08:12:07: 	Pass: testUpdateDoesNotRunOnUpgradeFrom399 (114s)
2019-04-19 08:12:07: 	Pass: testUpdateRunsOnNewInstall (230s)
2019-04-19 08:12:07: 	Pass: testUpdateRunsOnUpgradeFrom354 (106s)
2019-04-19 08:12:07: 	Pass: testUpdateRunsOnUpgradeFrom377 (99s)
2019-04-19 08:12:07: 	Pass: testUpdateSettings (279s)
2019-04-19 08:12:07: 	Pass: testValidRecordTypeNamesAreDiscardedIfOneRecordTypeNameIsExpected (7s)
2019-04-19 08:12:07: Class: UTIL_RecordTypes_TEST
2019-04-19 08:12:07: 	Pass: testLightningRecordTypes (332s)
2019-04-19 08:12:07: 	Pass: testRecTypes (117s)
2019-04-19 08:12:07: 	Pass: testVFRecordTypes (10s)
2019-04-19 08:12:07: Class: UTIL_String_TEST
2019-04-19 08:12:07: 	Pass: nonAsciiAlphabeticCharactersShouldBeRemoved (10s)
2019-04-19 08:12:07: 	Pass: nonAsciiAlphanuericCharactersShouldBeRemoved (5s)
2019-04-19 08:12:07: 	Pass: nonNumericCharactersShouldBeRemoved (11s)
2019-04-19 08:12:07: 	Pass: nullStringsShouldReturnNull (9s)
2019-04-19 08:12:07: Class: UTIL_Typeahead_TEST
2019-04-19 08:12:07: 	Pass: testQuery (430s)
2019-04-19 08:12:07: Class: UTIL_UnitTestData_TEST
2019-04-19 08:12:07: 	Pass: testCreateNewInactiveUserForTests (694s)
2019-04-19 08:12:07: 	Pass: testCreateNewUserWithDefaultRole (335s)
2019-04-19 08:12:07: 	Pass: testCreateNewUserWithRandomRole (422s)
2019-04-19 08:12:07: Class: UTIL_Where_TEST
2019-04-19 08:12:07: 	Pass: fieldExpEqualsSetsCorrectOperatorAndValue (85s)
2019-04-19 08:12:07: 	Pass: fieldExpGetSearchValueEscapesSingleQuotes (6s)
2019-04-19 08:12:07: 	Pass: fieldExpGetSearchValueReturnsEmptyStringWhenValueIsNull (5s)
2019-04-19 08:12:07: 	Pass: fieldExpGetSearchValueReturnsValue (6s)
2019-04-19 08:12:07: 	Pass: fieldExpGetSearchValueThrowsExceptionWhenOperatorIsNotEquals (6s)
2019-04-19 08:12:07: 	Pass: fieldExpInSetGetSearchValueExcludesNullsAndEmptyStrings (6s)
2019-04-19 08:12:07: 	Pass: fieldExpInSetGetSearchValueReturnsIdValues (7s)
2019-04-19 08:12:07: 	Pass: fieldExpInSetGetSearchValueReturnsValueWhenSetHasOneElement (6s)
2019-04-19 08:12:07: 	Pass: fieldExpInSetGetSearchValueReturnsValuesConnectedWithOR (5s)
2019-04-19 08:12:07: 	Pass: fieldExpInSetGetSearchValueThrowsExceptionWhenSetIsEmpty (6s)
2019-04-19 08:12:07: 	Pass: fieldExpInSetSetsCorrectOperatorAndValue (7s)
2019-04-19 08:12:07: 	Pass: fieldExpInSetToStringIncludesNullsAndEmptyStrings (7s)
2019-04-19 08:12:07: 	Pass: fieldExpInSetToStringReturnsCommaSeparatedElementsInQuotes (7s)
2019-04-19 08:12:07: 	Pass: fieldExpInSetToStringReturnsIdValues (6s)
2019-04-19 08:12:07: 	Pass: fieldExpInSetToStringReturnsValueWhenSetHasOneElement (7s)
2019-04-19 08:12:07: 	Pass: fieldExpInSetToStringThrowsExceptionWhenSetIsEmpty (6s)
2019-04-19 08:12:07: 	Pass: fieldExpMeetsCriteriaShouldReturnTrueWhenMatchingOnNull (6s)
2019-04-19 08:12:07: 	Pass: fieldExpMeetsCriteriaShouldReturnTrueWhenOperatorIsNotEqualsAndValueIsTheSame (9s)
2019-04-19 08:12:07: 	Pass: fieldExpMeetsCriteriaShouldReturnTrueWhenReferenceFieldValueIsMatched (11s)
2019-04-19 08:12:07: 	Pass: fieldExpMeetsCriteriaShouldReturnTrueWhenValueIsMatched (7s)
2019-04-19 08:12:07: 	Pass: fieldExpNotEqualsSetsCorrectOperatorAndValue (7s)
2019-04-19 08:12:07: 	Pass: fieldExpToStringEscapesSingleQuotes (6s)
2019-04-19 08:12:07: 	Pass: fieldExpToStringReturnsExpressionOnId (8s)
2019-04-19 08:12:07: 	Pass: fieldExpToStringReturnsExpressionOnNullValueWhenValueIsEmptyString (6s)
2019-04-19 08:12:07: 	Pass: fieldExpToStringReturnsExpressionOnNullValueWhenValueIsNull (7s)
2019-04-19 08:12:07: 	Pass: groupExpGetSearchValueReturnsEmptyStringWhenNoFieldExpIsProvided (8s)
2019-04-19 08:12:07: 	Pass: groupExpGetSearchValueReturnsFieldExpsConnectedWithANDByDefault (6s)
2019-04-19 08:12:07: 	Pass: groupExpGetSearchValueReturnsFieldExpsConnectedWithOR (6s)
2019-04-19 08:12:07: 	Pass: groupExpIsFilterableReturnsFalseWhenAtLeastOneFieldExpIsNotFilterable (5s)
2019-04-19 08:12:07: 	Pass: groupExpIsFilterableReturnsTrueWhenAllFieldExpsAreFilterable (4s)
2019-04-19 08:12:07: 	Pass: groupExpMeetsCriteriaShouldReturnTrueWhenAllValuesAreMatchedForANDOper (7s)
2019-04-19 08:12:07: 	Pass: groupExpMeetsCriteriaShouldReturnTrueWhenEitherValueMatchForOROper (9s)
2019-04-19 08:12:07: 	Pass: groupExpToStringDoesNotUseBracketsWhenHavingOneFieldExp (7s)
2019-04-19 08:12:07: 	Pass: groupExpToStringReturnsEmptyStringWhenNoFieldExpIsProvided (5s)
2019-04-19 08:12:07: 	Pass: groupExpToStringReturnsFieldExpsConnectedWithANDByDefault (6s)
2019-04-19 08:12:07: 	Pass: groupExpToStringReturnsFieldExpsConnectedWithOR (5s)
2019-04-19 08:12:07: 	Pass: whereBuildReturnsSoqlWhenAllGroupExpsAreFilterable (6s)
2019-04-19 08:12:07: 	Pass: whereBuildUsesOROperatorWhenItIsSet (6s)
2019-04-19 08:12:07: 	Pass: whereGetFieldsReturnsAllFieldNames (9s)
2019-04-19 08:12:07: 	Pass: whereIsFilterableReturnsFalseWhenAtLeastOneGroupExpIsNotFilterable (6s)
2019-04-19 08:12:07: 	Pass: whereIsFilterableReturnsTrueWhenAllGroupExpsAreFilterable (6s)
2019-04-19 08:12:07: 	Pass: whereIsFilterableReturnsTrueWhenWhereClauseIsEmpty (4s)
2019-04-19 08:12:07: 	Pass: whereMeetsCriteriaShouldReturnTrueWhenAllValuesAreMatchedForANDOper (10s)
2019-04-19 08:12:07: 	Pass: whereMeetsCriteriaShouldReturnTrueWhenAllValuesAreMatchedForOROper (9s)
2019-04-19 08:12:07: 	Pass: whereMeetsCriteriaShouldReturnTrueWhenItHasNoGroupExpression (5s)
2019-04-19 08:12:07: --------------------------------------------------------------------------------
2019-04-19 08:12:07: Pass: 1533  Fail: 2  CompileFail: 0  Skip: 0
2019-04-19 08:12:07: --------------------------------------------------------------------------------
2019-04-19 08:12:07: --------------------------------------------------------------------------------
2019-04-19 08:12:07: Failing Tests
2019-04-19 08:12:07: --------------------------------------------------------------------------------
2019-04-19 08:12:07: 1: CMT_MetadataAPI_TEST.test_cmt_api - Fail
2019-04-19 08:12:07: 	Message: System.NullPointerException: Attempt to de-reference a null object
2019-04-19 08:12:07: 	StackTrace: Class.CMT_MetadataAPI.MetadataCallBack.handleResult: line 179, column 1
Class.CMT_MetadataAPI_TEST.test_cmt_api: line 59, column 1
2019-04-19 08:12:07: 2: CRLP_ConfigBuilder_TEST.test_CMTdeployment - Fail
2019-04-19 08:12:07: 	Message: System.NullPointerException: Attempt to de-reference a null object
2019-04-19 08:12:07: 	StackTrace: Class.CMT_MetadataAPI.MetadataCallBack.handleResult: line 179, column 1
Class.CRLP_ConfigBuilder_TEST.test_CMTdeployment: line 105, column 1
2019-04-19 08:12:07: Logging error to sentry.io
2019-04-19 08:12:07: Exception in task run_tests
Traceback (most recent call last):
  File "/app/.heroku/python/lib/python3.7/site-packages/cumulusci/core/flowrunner.py", line 210, in run_step
    task()
  File "/app/.heroku/python/lib/python3.7/site-packages/cumulusci/core/tasks.py", line 141, in __call__
    self.result = self._run_task()
  File "/app/.heroku/python/lib/python3.7/site-packages/cumulusci/tasks/apex/testrunner.py", line 330, in _run_task
    self.counts.get("Fail"), self.counts.get("CompileFail")
cumulusci.core.exceptions.ApexTestException: 2 tests failed and 0 tests failed compilation