Build Exception: ApexTestException

1 tests failed and 0 tests failed compilation

Build Log

2017-08-11 15:37:29: -- Building commit 2e58c115934aec6fb07b72870e47b291dfd00990
2017-08-11 15:37:29: -- Download commit from URL: https://github.com/SalesforceFoundation/CumulusCI-Test/archive/2e58c115934aec6fb07b72870e47b291dfd00990.zip
2017-08-11 15:37:29: -- Extracting zip to temp dir /tmp/tmpS5FnK9
2017-08-11 15:37:29: -- Commit extracted to build dir: /tmp/tmpS5FnK9/CumulusCI-Test-2e58c115934aec6fb07b72870e47b291dfd00990
2017-08-11 15:37:30: Creating scratch org with command sfdx force:org:create -f orgs/dev.json 
2017-08-11 15:37:39: Successfully created scratch org: 00D1F0000000RZoUAM, username: test-8a1ikuxmul2o@cumulusci-test_dev_workspace.net

2017-08-11 15:37:39: Generating scratch org user password with command sfdx force:user:password:generate -u test-8a1ikuxmul2o@cumulusci-test_dev_workspace.net
2017-08-11 15:37:44: Getting scratch org info from Salesforce DX
2017-08-11 15:37:48: Running flow: ci_feature
2017-08-11 15:39:22: Build flow ci_feature completed with status error
2017-08-11 15:39:22:     MetadataApiError: <?xml version="1.0" encoding="UTF-8"?><soapenv:Envelope xmlns:soapenv="http://schemas.xmlsoap.org/soap/envelope/" xmlns="http://soap.sforce.com/2006/04/metadata"><soapenv:Body><checkDeployStatusResponse><result><checkOnly>false</checkOnly><completedDate>2017-08-11T22:39:20.000Z</completedDate><createdBy>0051F000000Hq7O</createdBy><createdByName>User User</createdByName><createdDate>2017-08-11T22:39:19.000Z</createdDate><details><runTestResult><numFailures>0</numFailures><numTestsRun>0</numTestsRun><totalTime>0.0</totalTime></runTestResult></details><done>true</done><errorMessage>REQUEST_RUNNING_TOO_LONG: Your request was running for too long, and has been stopped.</errorMessage><errorStatusCode>UNKNOWN_EXCEPTION</errorStatusCode><id>0Af1F000001pTykSAE</id><ignoreWarnings>true</ignoreWarnings><lastModifiedDate>2017-08-11T22:39:20.000Z</lastModifiedDate><numberComponentErrors>0</numberComponentErrors><numberComponentsDeployed>0</numberComponentsDeployed><numberComponentsTotal>1</numberComponentsTotal><numberTestErrors>0</numberTestErrors><numberTestsCompleted>0</numberTestsCompleted><numberTestsTotal>0</numberTestsTotal><rollbackOnError>true</rollbackOnError><runTestsEnabled>false</runTestsEnabled><startDate>2017-08-11T22:39:19.000Z</startDate><status>Failed</status><success>false</success></result></checkDeployStatusResponse></soapenv:Body></soapenv:Envelope>
2017-08-11 15:39:22: Deleting scratch org with command sfdx force:org:delete -p -u test-8a1ikuxmul2o@cumulusci-test_dev_workspace.net
2017-08-11 15:39:25: Successfully marked scratch org test-8a1ikuxmul2o@cumulusci-test_dev_workspace.net for deletion


=== Build restarted at 2017-08-11 22:59:41.920781+00:00 by cpolcyn ===
2017-08-11 16:00:21: -- Building commit 2e58c115934aec6fb07b72870e47b291dfd00990
2017-08-11 16:00:22: -- Download commit from URL: https://github.com/SalesforceFoundation/CumulusCI-Test/archive/2e58c115934aec6fb07b72870e47b291dfd00990.zip
2017-08-11 16:00:22: -- Extracting zip to temp dir /tmp/tmpyDWzAV
2017-08-11 16:00:22: -- Commit extracted to build dir: /tmp/tmpyDWzAV/CumulusCI-Test-2e58c115934aec6fb07b72870e47b291dfd00990
2017-08-11 16:00:23: Creating scratch org with command sfdx force:org:create -f orgs/dev.json 
2017-08-11 16:00:33: Successfully created scratch org: 00DJ0000003H32HMAS, username: test-tyvlnkahdbfu@cumulusci-test_dev_workspace.net

2017-08-11 16:00:33: Generating scratch org user password with command sfdx force:user:password:generate -u test-tyvlnkahdbfu@cumulusci-test_dev_workspace.net
2017-08-11 16:00:38: Getting scratch org info from Salesforce DX
2017-08-11 16:00:42: Running flow: ci_feature
2017-08-11 16:02:31: Build flow ci_feature completed with status fail
2017-08-11 16:02:31:     ApexTestException: 1 tests failed and 0 tests failed compilation
2017-08-11 16:02:31: Deleting scratch org with command sfdx force:org:delete -p -u test-tyvlnkahdbfu@cumulusci-test_dev_workspace.net
2017-08-11 16:02:35: Successfully marked scratch org test-tyvlnkahdbfu@cumulusci-test_dev_workspace.net for deletion


=== Build restarted at 2017-08-11 23:33:27.966660+00:00 by cpolcyn ===
2017-08-11 16:34:38: -- Building commit 2e58c115934aec6fb07b72870e47b291dfd00990
2017-08-11 16:34:38: -- Download commit from URL: https://github.com/SalesforceFoundation/CumulusCI-Test/archive/2e58c115934aec6fb07b72870e47b291dfd00990.zip
2017-08-11 16:34:39: -- Extracting zip to temp dir /tmp/tmpNo8Shw
2017-08-11 16:34:39: -- Commit extracted to build dir: /tmp/tmpNo8Shw/CumulusCI-Test-2e58c115934aec6fb07b72870e47b291dfd00990
2017-08-11 16:34:40: Creating scratch org with command sfdx force:org:create -f orgs/dev.json 
2017-08-11 16:34:50: Successfully created scratch org: 00D0q0000008gRgEAI, username: test-5bxt7xnlukd4@cumulusci-test_dev_workspace.net

2017-08-11 16:34:50: Generating scratch org user password with command sfdx force:user:password:generate -u test-5bxt7xnlukd4@cumulusci-test_dev_workspace.net
2017-08-11 16:34:56: Getting scratch org info from Salesforce DX
2017-08-11 16:35:00: Running flow: ci_feature
2017-08-11 16:37:34: Build flow ci_feature completed with status fail
2017-08-11 16:37:34:     ApexTestException: 1 tests failed and 0 tests failed compilation
2017-08-11 16:37:34: Deleting scratch org with command sfdx force:org:delete -p -u test-5bxt7xnlukd4@cumulusci-test_dev_workspace.net
2017-08-11 16:37:38: Successfully marked scratch org test-5bxt7xnlukd4@cumulusci-test_dev_workspace.net for deletion